Package Details: motrix v1.5.15-1

Git Clone URL: https://aur.archlinux.org/motrix.git (read-only, click to copy)
Package Base: motrix
Description: A full-featured download manager (release version)
Upstream URL: https://github.com/agalwood/Motrix
Keywords: aria2 motrix vue
Licenses: MIT
Conflicts: motrix-git
Submitter: weearc
Maintainer: weearc
Last Packager: weearc
Votes: 7
Popularity: 0.003482
First Submitted: 2019-01-17 19:34
Last Updated: 2020-06-14 09:53

Pinned Comments

weearc commented on 2020-06-04 10:14

======================NOTICE=========================
If you installed motrix from Arch Linux CN repo and got error, please to go https://github.com/archlinuxcn/repo
to complain about it or send an email to hotea.
The version of motrix in archlinuxcn is git version.

Your should install RELEASE version by using:

yaourt -S aur/motrix

================================================================

Latest Comments

1 2 3 Next › Last »

Anonymous comment on 2020-06-04 15:38

I installed via yay -S aur/motrix but still got the same error.

weearc commented on 2020-06-04 10:14

======================NOTICE=========================
If you installed motrix from Arch Linux CN repo and got error, please to go https://github.com/archlinuxcn/repo
to complain about it or send an email to hotea.
The version of motrix in archlinuxcn is git version.

Your should install RELEASE version by using:

yaourt -S aur/motrix

================================================================

weearc commented on 2020-06-04 10:11

@francois072 Did you install it from Arch Linux CN repo? If so, change to this release version of motrix using the following command:

yaourt -S aur/motrix

The git version of motrix isn't that stable.

Anonymous comment on 2020-06-03 20:57

[francois@francois-pc ~]$ motrix [607830:0603/225450.904906:FATAL:setuid_sandbox_host.cc(157)] The SUID sandbox helper binary was found, but is not configured correctly. Rather than run without sandboxing I'm aborting now. You need to make sure that /opt/motrix/chrome-sandbox is owned by root and has mode 4755. Trace/breakpoint trap (core dumped) [francois@francois-pc ~]$ sudo motrix [sudo] password for francois: [607858:0603/225500.564768:FATAL:electron_main_delegate.cc(211)] Running as root without --no-sandbox is not supported. See https://crbug.com/638180. Trace/breakpoint trap

weearc commented on 2020-05-14 16:42

@xoyzoo This is probably an error due to the dependency downloading error. Please try again.

xoyzoo commented on 2020-05-14 14:55

gyp ERR! configure error gyp ERR! stack Error: Command failed: /usr/bin/python -c import sys; print "%s.%s.%s" % sys.version_info[:3]; gyp ERR! stack File "<string>", line 1 gyp ERR! stack import sys; print "%s.%s.%s" % sys.version_info[:3]; gyp ERR! stack ^ gyp ERR! stack SyntaxError: invalid syntax gyp ERR! stack gyp ERR! stack at ChildProcess.exithandler (child_process.js:303:12) gyp ERR! stack at ChildProcess.emit (events.js:315:20) gyp ERR! stack at maybeClose (internal/child_process.js:1051:16) gyp ERR! stack at Socket.<anonymous> (internal/child_process.js:442:11) gyp ERR! stack at Socket.emit (events.js:315:20) gyp ERR! stack at Pipe.<anonymous> (net.js:671:12) gyp ERR! System Linux 5.6.12-arch1-1 gyp ERR! command "/usr/bin/node" "/home/le/.cache/yay/motrix/src/Motrix/node_modules/node-gyp/bin/node-gyp.js" "rebuild" "--verbose" "--libsass_ext=" "--libsass_cflags=" "--libsass_ldflags=" "--libsass_library=" gyp ERR! cwd /home/le/.cache/yay/motrix/src/Motrix/node_modules/node-sass gyp ERR! node -v v14.2.0 gyp ERR! node-gyp -v v3.8.0 gyp ERR! not ok Build failed with error code: 1 npm WARN optional SKIPPING OPTIONAL DEPENDENCY: fsevents@1.2.9 (node_modules/fsevents): npm WARN notsup SKIPPING OPTIONAL DEPENDENCY: Unsupported platform for fsevents@1.2.9: wanted {"os":"darwin","arch":"any"} (current: {"os":"linux","arch":"x64"})

npm ERR! code ELIFECYCLE npm ERR! errno 1 npm ERR! node-sass@4.12.0 postinstall: node scripts/build.js npm ERR! Exit status 1 npm ERR! npm ERR! Failed at the node-sass@4.12.0 postinstall script. npm ERR! This is probably not a problem with npm. There is likely additional logging output above.

npm ERR! A complete log of this run can be found in: npm ERR! /home/le/.npm/_logs/2020-05-14T14_51_13_252Z-debug.log ==> ERROR: A failure occurred in build(). Aborting... Error making: motrix

weearc commented on 2020-05-03 08:25

@maniacata The build failure is caused by yarn linking dependencies wrong. And it's fixed now

maniacata commented on 2020-05-03 04:48

$ electron-builder install-app-deps && npm run lint:fix

Error: Unresolved node modules: bufferutil, utf-8-validate

xstefen commented on 2020-01-22 17:47

Eliminated China optimization code in order to get a successful installation

https://0x0.st/zCwu.txt

weearc commented on 2019-09-03 15:26

@P-McNewHold @Fans PKGBUILD has been updated and use the former method to pack please try to install it again.