Package Details: scribus-svn 23065-1

Git Clone URL: https://aur.archlinux.org/scribus-svn.git (read-only)
Package Base: scribus-svn
Description: A desktop publishing program - Version from SVN
Upstream URL: http://www.scribus.net
Licenses: GPL, LGPL
Conflicts: scribus
Provides: scribus
Submitter: None
Maintainer: haawda
Last Packager: haawda
Votes: 50
Popularity: 0.000014
First Submitted: 2008-04-27 21:07
Last Updated: 2019-07-04 17:20

Latest Comments

« First ‹ Previous ... 5 6 7 8 9 10

Anonymous comment on 2011-01-24 05:31

Package updated once again.

_svntrunk is now correct.

And there is the the "-Wl,--as-needed" bug again. I'll leave the fix in there for good.

haawda commented on 2011-01-16 23:08

_svntrunk has to be changed to svn://scribus.net/trunk (upstream change).

Anonymous comment on 2010-12-29 00:07

Package updated.

Python dependency has been replaced by python2. (thank you Stefan)

The linker error discussed earlier seems to have been resolved.
If you still suffer from this error and you are running an up-to-date system drop me a mail or leave a comment.
The temporary fix is still included in the script as a comment.

haawda commented on 2010-12-17 23:10

I think the dependency python should be replaced by python2.

Anonymous comment on 2010-09-05 23:44

I adopted this package.

The linker error described earlier dissappeared after I removed the "-Wl,--as-needed" flag from the link command.
This should only be a temporary solution assuming the error is caused by a bug in the linker.

haawda commented on 2010-06-05 12:15

confirmed

Anonymous comment on 2010-06-03 19:24

I got this when I tried to build:

colormgmt/libscribus_colormgmt_lib.a(sclcmscolormgmtengineimpl.cpp.o): In function `ScLcmsColorMgmtEngineImpl::ScLcmsColorMgmtEngineImpl()':
sclcmscolormgmtengineimpl.cpp:(.text+0x41e7): undefined reference to `cmsSetAlarmCodes'
colormgmt/libscribus_colormgmt_lib.a(sclcmscolorprofileimpl.cpp.o): In function `ScLcmsColorProfileImpl::deviceClass() const':
sclcmscolorprofileimpl.cpp:(.text+0x1e): undefined reference to `cmsGetDeviceClass'
colormgmt/libscribus_colormgmt_lib.a(sclcmscolorprofileimpl.cpp.o): In function `ScLcmsColorProfileImpl::colorSpace() const':
sclcmscolorprofileimpl.cpp:(.text+0x4e): undefined reference to `cmsGetColorSpace'
colormgmt/libscribus_colormgmt_lib.a(sclcmscolorprofileimpl.cpp.o): In function `ScLcmsColorProfileImpl::productDescription() const':
sclcmscolorprofileimpl.cpp:(.text+0x9e): undefined reference to `cmsTakeProductDesc'
colormgmt/libscribus_colormgmt_lib.a(sclcmscolorprofileimpl.cpp.o): In function `ScLcmsColorProfileImpl::closeProfile()':
sclcmscolorprofileimpl.cpp:(.text+0x17e): undefined reference to `cmsCloseProfile'
colormgmt/libscribus_colormgmt_lib.a(sclcmscolortransformimpl.cpp.o): In function `ScLcmsColorTransformImpl::apply(void*, void*, unsigned int)':
sclcmscolortransformimpl.cpp:(.text+0x20): undefined reference to `cmsDoTransform'
colormgmt/libscribus_colormgmt_lib.a(sclcmscolortransformimpl.cpp.o): In function `ScLcmsColorTransformImpl::apply(QByteArray&, QByteArray&, unsigned int)':
sclcmscolortransformimpl.cpp:(.text+0xa6): undefined reference to `cmsDoTransform'
colormgmt/libscribus_colormgmt_lib.a(sclcmscolortransformimpl.cpp.o): In function `ScLcmsColorTransformImpl::deleteTransform()':
sclcmscolortransformimpl.cpp:(.text+0x13e): undefined reference to `cmsDeleteTransform'
collect2: ld returned 1 exit status
make[2]: *** [scribus/scribus] Error 1
make[1]: *** [scribus/CMakeFiles/scribus.dir/all] Error 2
make: *** [all] Error 2
==> ERROR: Build Failed.
Aborting...