Package Details: traverso 0.49.4-1

Git Clone URL: https://aur.archlinux.org/traverso.git (read-only)
Package Base: traverso
Description: Digital Audio Workstation with an innovative User Interface
Upstream URL: http://traverso-daw.org/
Licenses: GPL
Submitter: shinlun
Maintainer: smiszym
Last Packager: smiszym
Votes: 40
Popularity: 0.000194
First Submitted: 2007-06-04 10:18
Last Updated: 2015-06-09 12:18

Latest Comments

Anonymous comment on 2013-04-11 14:15

The qt dependency needs to be updated to qt4. Everything still works otherwise.

speps commented on 2012-04-26 00:22

@mrbit Thanks for reporting. Updated to 0.49.2-3, with new build patches. Added desktop file, icons and mime.

mrbit commented on 2012-04-25 19:58

[ 21%] Building CXX object src/core/CMakeFiles/traversocore.dir/FileHelpers.o
/tmp/packerbuild-0/traverso/traverso/src/traverso-0.49.2/src/core/FileHelpers.cpp: In static member function ‘static int FileHelper::copy_recursively(const QString&, const QString&)’:
/tmp/packerbuild-0/traverso/traverso/src/traverso-0.49.2/src/core/FileHelpers.cpp:144:53: error: ‘read’ was not declared in this scope
/tmp/packerbuild-0/traverso/traverso/src/traverso-0.49.2/src/core/FileHelpers.cpp:153:39: error: ‘write’ was not declared in this scope
make[2]: *** [src/core/CMakeFiles/traversocore.dir/FileHelpers.o] Errore 1
make[1]: *** [src/core/CMakeFiles/traversocore.dir/all] Errore 2
make: *** [all] Errore 2

hollunder commented on 2011-11-30 15:17

Please don't flag out of date unless a new stable release is available. The latest stable release at time of writing is 0.49.2.

hollunder commented on 2011-08-23 12:49

It fails to build for me too, please report upstream.

Druedain commented on 2011-08-21 15:48

I can't build this.

[ 43%] Building C object src/3rdparty/slv2/CMakeFiles/traversoslv2.dir/src/plugin.o
cd /tmp/packerbuild-0/traverso/traverso/src/traverso-0.49.2/src/3rdparty/slv2 && /usr/bin/gcc -DQT_GUI_LIB -DQT_CORE_LIB -DSTATIC_BUILD -DQT_NO_DEBUG -DLV2_SUPPORT -DMP3_DECODE_SUPPORT -DMP3_ENCODE_SUPPORT -DHAVE_SYS_VFS_H -DHAVE_SYS_STAT_H -DUSE_MLOCK -DALSA_SUPPORT -DJACK_SUPPORT -DSSE_OPTIMIZATIONS -DUSE_XMMINTRIN -DUSE_X86_64_ASM -DQT_NO_DEBUG -march=x86-64 -mtune=generic -O2 -pipe -fstack-protector --param=ssp-buffer-size=4 -D_FORTIFY_SOURCE=2 -std=c99 -I/tmp/packerbuild-0/traverso/traverso/src/traverso-0.49.2/src/3rdparty/slv2 -I/usr/include/QtGui -I/usr/include/QtCore -I/usr/include/redland -I/usr/include/rasqal -I/tmp/packerbuild-0/traverso/traverso/src/traverso-0.49.2/src/common -o CMakeFiles/traversoslv2.dir/src/plugin.o -c /tmp/packerbuild-0/traverso/traverso/src/traverso-0.49.2/src/3rdparty/slv2/src/plugin.c
In file included from /tmp/packerbuild-0/traverso/traverso/src/traverso-0.49.2/src/3rdparty/slv2/src/plugin.c:25:0:
/usr/include/librdf.h:31:21: fatal error: raptor2.h: Nie ma takiego pliku ani katalogu
compilation terminated.
make[2]: *** [src/3rdparty/slv2/CMakeFiles/traversoslv2.dir/src/plugin.o] Błąd 1
make[2]: Opuszczenie katalogu `/tmp/packerbuild-0/traverso/traverso/src/traverso-0.49.2'
make[1]: *** [src/3rdparty/slv2/CMakeFiles/traversoslv2.dir/all] Błąd 2
make[1]: Opuszczenie katalogu `/tmp/packerbuild-0/traverso/traverso/src/traverso-0.49.2'
make: *** [all] Błąd 2
==> BŁĄD: Wystąpił błąd w build().
Przerywam...
The build failed.