Package Base Details: linux-pf

Git Clone URL: https://aur.archlinux.org/linux-pf.git (read-only, click to copy)
Submitter: nous
Maintainer: Thaodan
Last Packager: Thaodan
Votes: 201
Popularity: 1.45
First Submitted: 2011-07-24 12:01
Last Updated: 2020-07-23 01:21

Pinned Comments

Thaodan commented on 2019-11-25 12:39

Hey,

I have no internet connnection until next friday so updates will have to wait until then. But please don't spam the comments with patches and remove them! If you have any (larger) issues please report them on gitlab and use a pasting service/attachment (the last one is better).

Thaodan commented on 2018-08-05 16:08

upstream git repo:* (https://gitlab.com/Thaodan/linux-pf)

repo in /etc/pacman.conf:

[home-thaodan]
Server = https://thaodan.de/public/archlinux/home-thaodan/x86_64/

import the key

sudo pacman-key --recv-keys BBFE2FD421597395E4FC8C8DF6C85FEE79D661A4
pacman-key --finger BBFE2FD421597395E4FC8C8DF6C85FEE79D661A4
sudo pacman-key --lsign-key  BBFE2FD421597395E4FC8C8DF6C85FEE79D661A4
sudo pacman-key --refresh-keys

fingerprint:

gpg: enabled debug flags: memstat
gpg: keydb: handles=1 locks=0 parse=0 get=1
gpg:        build=0 update=0 insert=0 delete=0
gpg:        reset=0 found=1 not=1 cache=0 not=0
gpg: kid_not_found_cache: count=0 peak=0 flushes=0
gpg: sig_cache: total=2 cached=2 good=2 bad=0
gpg: random usage: poolsize=600 mixed=0 polls=0/0 added=0/0
           outmix=0 getlvl1=0/0 getlvl2=0/0
gpg: rndjent stat: collector=0x0000000000000000 calls=0 bytes=0
gpg: secmem usage: 0/32768 bytes in 0 blocks
pub   rsa2048 2015-02-13 [SC]
       BBFE 2FD4 2159 7395 E4FC  8C8D F6C8 5FEE 79D6 61A4
uid        [ ultimativ ] Björn Bidar <theodorstormgrade@gmail.com>
sub   rsa2048 2015-02-13 [E]

Latest Comments

« First ‹ Previous 1 2 3 4 5 6 7 8 9 10 ... Next › Last »

Thaodan commented on 2018-05-27 14:43

I build a version right now and it failed without errors. I try a clean chroot pls

tydynrain commented on 2018-05-26 00:14

I've gotten build errors on three machines for linux-pf since 4.16.4.2, and no matter what I try, it refuses to build successfully. This is using trizen, but I've also used pacaur, straight makepkg, and aurutils/aursync, but it fails with all of them.

Error Message:

../lib/str_error_r.c: In function ‘str_error_r’:

../lib/str_error_r.c:25:3: error: passing argument 1 to restrict-qualified parameter aliases with argument 5 [-Werror=restrict]

snprintf(buf, buflen, "INTERNAL ERROR: strerror_r(%d, %p, %zd)=%d", errnum, buf, buflen, err);

^~~~~~~~ cc1: all warnings being treated as errors

mv: cannot stat '/tmp/trizen-tydynrain/linux-pf/src/linux-4.16/tools/objtool/.str_error_r.o.tmp': No such file or directory

LD /tmp/trizen-tydynrain/linux-pf/src/linux-4.16/tools/objtool/libsubcmd-in.o

make[3]: *** [Build:22: /tmp/trizen-tydynrain/linux-pf/src/linux-4.16/tools/objtool/str_error_r.o] Error 1

make[3]: *** Waiting for unfinished jobs....

AR /tmp/trizen-tydynrain/linux-pf/src/linux-4.16/tools/objtool/libsubcmd.a

HOSTCC arch/x86/tools/relocs_32.o

HOSTCC arch/x86/tools/relocs_64.o

make[2]: *** [Makefile:46: /tmp/trizen-tydynrain/linux-pf/src/linux-4.16/tools/objtool/objtool-in.o] Error 2

make[1]: *** [Makefile:63: objtool] Error 2

make: *** [Makefile:1687: tools/objtool] Error 2

make: *** Waiting for unfinished jobs....

HOSTCC arch/x86/tools/relocs_common.o

HOSTLD arch/x86/tools/relocs

==> ERROR: A failure occurred in build().

Aborting...

:: Unable to build linux-pf-preset-default - makepkg exited with code: 2

bartus commented on 2018-04-22 11:13

@Thaodan: I have same issue as @simona

==> Starting package_linux-pf-headers()...
cp: cannot stat 'drivers/media/dvb-core/*.h': No such file or directory

header files has been moved to include/media/ folder

simona commented on 2018-04-21 09:01

cp: impossibile eseguire stat di 'drivers/media/dvb-core/*.h': File o directory non esistente ==> ERRORE: Si è verificato un errore in package_linux-pf-headers(). L'operazione sta per essere interrotta... :: Errore compilando il/i pacchetto/i linux-pf-headers,linux-pf-preset-default,linux-pf

simona commented on 2018-04-20 16:38

4.16?

LookTJ commented on 2018-04-12 02:16

==> ERROR: Integrity checks (sha256) differ in size from the source array.

Thaodan commented on 2018-04-08 07:30

the makepkg.conf file was inted for me to build i686 kernel without a clean chroot.

I pushed the next update to a testing branch like before, until 4.16-ARCH in core. https://gitlab.com/Thaodan/linux-pf/tree/linux4.16

tydynrain commented on 2018-02-28 07:34

With the latest update (4.15.4-1) the makepkg.conf file has a few errors that prevent a successful build unless I manually fix them.

CARCH="i686" CHOST="i686-pc-linux-gnu"

Those, of course, need to be changed to "x86_64" and "x86_64-pc-linux-gnu" respectively.

Also, there is an extra space between mtune=native and -02 in CFLAGS

CFLAGS="-march=native mtune=native -O2 -pipe -fstack-protector-strong -fno-plt"

Once I changed those, it built successfully.

skyfair commented on 2018-02-22 19:04

kernel is working fine, thank you.

Thaodan commented on 2018-02-02 07:54

As long as 4.15 as is in testing. I pushed 4.14 to my testing branch on gitlab, see here: https://gitlab.com/Thaodan/linux-pf/tree/linux4.15

I commit every changes needed to all modules for 4.15 here so if you want to grab everything just clone the repo of my repo. https://gitlab.com/Thaodan/repo-home-thaodan/tree/testing