Package Details: cairo-compmgr-git 1:0.3.1.57.g416ae1a-3

Git Clone URL: https://aur.archlinux.org/cairo-compmgr-git.git (read-only, click to copy)
Package Base: cairo-compmgr-git
Description: Cairo based composite manager - Git version
Upstream URL: http://cairo-compmgr.tuxfamily.org/
Licenses: LGPL3
Conflicts: cairo-compmgr
Provides: cairo-compmgr
Submitter: None
Maintainer: bidulock
Last Packager: bidulock
Votes: 112
Popularity: 0.000000
First Submitted: 2009-09-11 20:11
Last Updated: 2015-10-21 03:04

Required by (0)

Sources (1)

Latest Comments

« First ‹ Previous 1 2 3 4 5 6 7 8 ... Next › Last »

cgirard commented on 2014-03-31 19:57

Nice! I'll update ASAP. Did you report upstream?

socke commented on 2014-03-31 19:50

I've fixed the build errors and posted the two patches with a new PKGBUILD in the german thread on: https://bbs.archlinux.de/viewtopic.php?pid=320986#p320986

cgirard commented on 2014-02-23 14:30

Xiaoming94: sorry but I still haven't find how to solve the error reported by Next7. The libiberty error is easy to fix (just replace libiberty.h by libiberty/libiberty.h in the include) but I cannot release a new version which still does not compile.

Xiaoming94 commented on 2014-02-22 21:49

I Get the same Compilation error as dnf

cgirard commented on 2014-01-07 14:02

I have tried a fix which works on cairo-compmgr PKGBUILD but not on the git version (I am hitting the compilation error given by Next7 below).

cgirard commented on 2014-01-07 14:00

Fixed (thanks to xartii)

dnf commented on 2014-01-05 17:54

build() ends up with error:

ccm-debug.c:59:23: fatal error: libiberty.h: No such file or directory
#include <libiberty.h>

I have found the file in:
/usr/include/libiberty.h

Apparently, other users had the same problem, as described here (in German language):
https://bbs.archlinux.de/viewtopic.php?pid=316132

Any sugestions how to build it?

Next7 commented on 2013-12-02 04:01

The package fails to build with vala-0.22.1-1. Any suggestions?
===
cairo-compmgr.vapi:484.9-484.33: error: overriding method `CCM.Window.query_opacity' is incompatible with base method `CCM.WindowPlugin.query_opacity': incompatible type of parameter 1.
public void query_opacity (bool deleted);
^^^^^^^^^^^^^^^^^^^^^^^^^
cairo-compmgr.vapi:494.9-494.37: error: overriding method `CCM.Window.set_opaque_region' is incompatible with base method `CCM.WindowPlugin.set_opaque_region': incompatible type of parameter 1.
public void set_opaque_region (CCM.Region region);
^^^^^^^^^^^^^^^^^^^^^^^^^^^^^
cairo-compmgr.vapi:273.9-273.30: error: overriding method `CCM.Screen.add_window' is incompatible with base method `CCM.ScreenPlugin.add_window': incompatible type of parameter 1.
public bool add_window (CCM.Window window);
^^^^^^^^^^^^^^^^^^^^^^
cairo-compmgr.vapi:274.9-274.33: error: overriding method `CCM.Screen.remove_window' is incompatible with base method `CCM.ScreenPlugin.remove_window': incompatible type of parameter 1.
public void remove_window (CCM.Window window);
^^^^^^^^^^^^^^^^^^^^^^^^^
ccm-window-animation.vala:322.27-322.29: warning: Gtk is deprecated. Use gtk+-3.0
Compilation failed: 4 error(s), 2 warning(s)
Makefile:569: recipe for target 'libccm_window_animation_la_vala.stamp' failed
make[2]: *** [libccm_window_animation_la_vala.stamp] Error 1
make[2]: Leaving directory 'aur/cairo-compmgr-git/src/cairocompmgr/plugins/window-animation'
Makefile:429: recipe for target 'all-recursive' failed
make[1]: *** [all-recursive] Error 1
make[1]: Leaving directory 'aur/cairo-compmgr-git/src/cairocompmgr/plugins'
Makefile:499: recipe for target 'all-recursive' failed
make: *** [all-recursive] Error 1
==> ERROR: A failure occurred in build().
Aborting...

cgirard commented on 2013-11-12 11:41

@ckozler: there is not much I can do. Please report this directly to upstream.

ckozler commented on 2013-11-09 23:56

Hi -

First off thank you for providing this package- it really is lightweight and great!

However, after I moved from xf86-video-ati to catalyst-hook/catalyst driver on xorg 1.3 I can no longer seem to run this. Stack trace is below - please let me know what else you need from me to help solve this

┌─[18:54:01]─[ckozler@localhost]
└──> cairo-compmgr-git $ >> cairo-compmgr
Xlib: extension "RANDR" missing on display ":0.0".
0.000002:
0.000516: IA__gtk_widget_set_colormap: assertion 'GDK_IS_COLORMAP (colormap)' failed
0.004024: ??:0 ccm_log_print_backtrace()
0.004067: ??:0 g_logv()
0.004091: ??:0 g_log()
0.004137: ??:0 ccm_preferences_new()
0.004155: ??:0 ccm_tray_menu_new()
0.004174: ??:0 ccm_tray_icon_new()
0.004193: ??:0 main()
0.004211: ??:0 __libc_start_main()
0.004229: ??:0 _start()
0.006077:
0.006111: g_object_unref: assertion 'G_IS_OBJECT (object)' failed
0.009137: ??:0 ccm_log_print_backtrace()
0.009173: ??:0 g_logv()
0.009196: ??:0 g_log()
0.009239: ??:0 ccm_window_new()
0.009259: ??:0 g_object_unref()
0.009276: ??:0 ccm_display_new()
0.009295: ??:0 ccm_tray_menu_new()
0.009312: ??:0 ccm_tray_icon_new()
0.009329: ??:0 main()
0.009348: ??:0 __libc_start_main()
0.009364: ??:0 _start()
0.009383:
0.009394: g_object_unref: assertion 'G_IS_OBJECT (object)' failed
0.012055: ??:0 ccm_log_print_backtrace()
0.012079: ??:0 g_logv()
0.012094: ??:0 g_log()
0.012109: ??:0 ccm_window_new()
0.012124: ??:0 g_object_unref()
0.012138: ??:0 ccm_display_new()
0.012152: ??:0 ccm_tray_menu_new()
0.012166: ??:0 ccm_tray_icon_new()
0.012181: ??:0 main()
0.012195: ??:0 __libc_start_main()
0.012209: ??:0 _start()
0.012236:
0.012251: Composite init failed for (null)
0.014746: ??:0 ccm_log_print_backtrace()
0.014780: ??:0 g_logv()
0.014801: ??:0 g_log()
0.014844: ??:0 ccm_display_new()
0.014862: ??:0 ccm_tray_menu_new()
0.014882: ??:0 ccm_tray_icon_new()
0.014901: ??:0 main()
0.014918: ??:0 __libc_start_main()
0.014936: ??:0 _start()