Package Details: clementine-git 1.2.3.1109.g7cd4a56-1

Git Clone URL: https://aur.archlinux.org/clementine-git.git (read-only)
Package Base: clementine-git
Description: A modern music player and library organiser and a port of Amarok 1.4, with some features rewritten to take advantage of Qt4.
Upstream URL: http://www.clementine-player.org/
Licenses: GPL
Conflicts: clementine
Provides: clementine
Replaces: clementine
Submitter: archdria
Maintainer: Gryffyn
Last Packager: vlad
Votes: 76
Popularity: 0.911873
First Submitted: 2011-07-19 22:38
Last Updated: 2015-07-08 12:39

Latest Comments

xiong.chiamiov commented on 2016-02-29 23:22

1.3 RC shouldn't matter, since this package builds from git HEAD. The version number is autogenerated from git-describe.

varlesh commented on 2016-02-06 21:11

1.3 RC version?
https://github.com/clementine-player/Clementine/releases/tag/1.3rc1

NOTtheMessiah commented on 2016-01-16 09:01

I'm getting issues when I try to compile with protobuf3:

../libclementine-tagreader/liblibclementine-tagreader.a(tagreader.cpp.o):tagreader.cpp:(.text+0x3861): more undefined references to `google::protobuf::internal::empty_string_[abi:cxx11]' follow
collect2: error: ld returned 1 exit status
ext/clementine-tagreader/CMakeFiles/clementine-tagreader.dir/build.make:159: recipe for target 'clementine-tagreader' failed
make[2]: *** [clementine-tagreader] Error 1
CMakeFiles/Makefile2:2293: recipe for target 'ext/clementine-tagreader/CMakeFiles/clementine-tagreader.dir/all' failed
make[1]: *** [ext/clementine-tagreader/CMakeFiles/clementine-tagreader.dir/all] Error 2
Makefile:127: recipe for target 'all' failed
make: *** [all] Error 2

xiong.chiamiov commented on 2015-12-17 17:33

To get this working with Spotify, I had to pull the protobuf PKGBUILD out of ABS and add options=('staticlibs') to prevent it from stripping the static library that clementine wants.

Chocobozzz commented on 2015-05-05 10:18

The hack is not needed anymore, fixed in the master branch (https://github.com/clementine-player/Clementine/commit/082a1d3e94aee5deaef639cfc8f57348570816d0) :)

archdria commented on 2015-04-29 19:27

Updated, thanks :)

post-factum commented on 2015-04-29 18:32

Consider adding the following command to PKGBUILD (before calling make) to fix crypto++ issue:

===
sed -i 's/crypto++/cryptopp/g' ${srcdir}/Clementine/src/internet/spotify/spotifyblobdownloader.cpp
===

ryuzy commented on 2015-04-29 08:24

I think in src/internet/spotify/spotifyblobdownloader.cpp
#include <crypto++/pkcspad.h>
#include <crypto++/rsa.h>

Should be edited to:
#include <cryptopp/pkcspad.h>
#include <cryptopp/rsa.h>

ryuzy commented on 2015-04-29 08:17

I'm receiving this error:
/tmp/yaourt-tmp-ryuzaki/aur-clementine-git/src/Clementine/src/internet/spotify/spotifyblobdownloader.cpp:42:30: fatal error: crypto++/pkcspad.h: No such file or directory
#include <crypto++/pkcspad.h>
^
compilation terminated.
src/CMakeFiles/clementine_lib.dir/build.make:11347: recipe for target 'src/CMakeFiles/clementine_lib.dir/internet/spotify/spotifyblobdownloader.cpp.o' failed
make[2]: *** [src/CMakeFiles/clementine_lib.dir/internet/spotify/spotifyblobdownloader.cpp.o] Error 1

Am I the only one?

archdria commented on 2015-04-29 07:51

Updated dependencies :)

All comments