Package Details: cloog 0.20.0-1

Git Clone URL: (read-only)
Package Base: cloog
Description: Library that generates loops for scanning polyhedra
Upstream URL:
Keywords: lib
Licenses: GPL
Submitter: haawda
Maintainer: aaronfischer (nougad)
Last Packager: aaronfischer
Votes: 63
Popularity: 2.275835
First Submitted: 2014-11-19 12:18
Last Updated: 2018-09-10 18:22

Latest Comments

« First ‹ Previous 1 2 3 4 5 6 7 Next › Last »

marcvangend commented on 2016-05-26 13:53

@apaatsio there seems to be some circular dependency. I solved it by simply uninstalling both packages (`sudo pacman -R cloog isl`) and then reinstalling cloog.

apaatsio commented on 2016-05-26 09:46

==> Continue installing isl15 ? [Y/n]
==> [v]iew package contents [c]heck package with namcap
==> ---------------------------------------------------
==> y

loading packages...
resolving dependencies...
looking for conflicting packages...
:: isl15 and isl are in conflict. Remove isl? [y/N] y
error: failed to prepare transaction (could not satisfy dependencies)
:: cloog: removing isl breaks dependency 'isl>=0.14'
==> WARNING: Your packages are saved in /tmp/yaourt-tmp-antti
cp: overwrite '/tmp/yaourt-tmp-antti/isl15-0.15-1-x86_64.pkg.tar.xz'? y
==> Restart building cloog ? [y/N]

What's happening here? What should I do to fix the conflict between isl15 and isl?

aaronfischer commented on 2016-05-25 18:52

Thanks! I've added isl15 as the dependency.

Rynsin commented on 2016-05-24 20:10

Can confirm that you need to use isl15 to make this work (and modify the depend in the PKGBUILD) as of today.

Beacon515L commented on 2016-05-21 08:47

I made a package for isl 0.15 to make flortsch's fix a bit easier.

flortsch commented on 2016-05-17 13:36

Faced the same problem and fixed it by installing isl 0.15, hope it helps.

GeorgeChao commented on 2016-05-13 06:58

When I using makepkg with cloog, I meet some trouble.

make[3]: Entering directory '/home/gg/softwares/cloog/src/cloog-0.18.4/test'
make[4]: Entering directory '/home/gg/softwares/cloog/src/cloog-0.18.4/test'
cd ..; make
make[5]: Entering directory '/home/gg/softwares/cloog/src/cloog-0.18.4'
make[5]: '' is up to date.
make[5]: Leaving directory '/home/gg/softwares/cloog/src/cloog-0.18.4'
make[4]: Leaving directory '/home/gg/softwares/cloog/src/cloog-0.18.4/test'
Testsuite summary for cloog 0.18.4
# TOTAL: 5
# PASS: 2
# SKIP: 0
# XFAIL: 0
# FAIL: 3
# XPASS: 0
# ERROR: 0
See test/test-suite.log
Please report to
Makefile:940: recipe for target 'test-suite.log' failed
make[3]: *** [test-suite.log] Error 1
make[3]: Leaving directory '/home/gg/softwares/cloog/src/cloog-0.18.4/test'
Makefile:1046: recipe for target 'check-TESTS' failed
make[2]: *** [check-TESTS] Error 2
make[2]: Leaving directory '/home/gg/softwares/cloog/src/cloog-0.18.4/test'
Makefile:1147: recipe for target 'check-am' failed
make[1]: *** [check-am] Error 2
make[1]: Leaving directory '/home/gg/softwares/cloog/src/cloog-0.18.4/test'
Makefile:1046: recipe for target 'check-recursive' failed
make: *** [check-recursive] Error 1
==> ERROR: A failure occurred in check().

aaronfischer commented on 2016-04-11 08:41

@cengizIO: I've reported the problem upstream (!topic/cloog-development/O6pH-ZqNx6g)

cengiz_io commented on 2016-04-09 12:33


0.18.4-1 tests fail with isl 0.16 (

Installing isl 0.15 from upstream ( allows cloog tests to pass.

aaronfischer commented on 2015-02-16 20:25

Thanks for your suggestions and tests! I've added isl>=0.14 version dependency and add the -j1 switch to the check function.