Package Details: coolreader3-git r4097.1e07d15-3

Git Clone URL: https://aur.archlinux.org/coolreader3-git.git (read-only)
Package Base: coolreader3-git
Description: E-book reader for Linux
Upstream URL: http://sourceforge.net/projects/crengine/
Licenses: GPL2
Conflicts: coolreader3
Provides: coolreader3
Submitter: KroshKobel
Maintainer: KroshKobel
Last Packager: KroshKobel
Votes: 32
Popularity: 0.898700
First Submitted: 2015-09-10 09:45
Last Updated: 2015-10-09 15:40

Latest Comments

viler80 commented on 2017-09-25 19:23

https://drive.google.com/file/d/0B4g6Jka9AGb-TGRWOHE4T1ZZOTA/view?usp=sharing reassembled from .deb

viler80 commented on 2017-09-25 19:13

same problem
2017/09/26 00:10:04.5566 ERROR Error opening file /home/viler80/.cr3/cache/cr3cache.inx for reading
2017/09/26 00:10:04.5567 ERROR Document cache index file cannot be read
2017/09/26 00:10:04.5575 ERROR Error opening file /home/viler80/.cr3/cache/cr3cache.inx for reading
2017/09/26 00:10:04.5576 ERROR Error opening file /home/viler80/.cr3/cr3.ini for reading
2017/09/26 00:10:04.5576 ERROR Cannot load settings from file /home/viler80/.cr3/cr3.ini
Segmentation fault (core dumped)

hemant_ng commented on 2017-08-15 06:47

CR3 gives similar errors for me and segfaults.

$ /usr/bin/cr3
2017/08/15 12:07:36.1884 WARN Changing log level from 3 to 1
303 fonts loaded.
2017/08/15 12:07:36.2229 ERROR Canot load translation file cr3_en_US from dir /usr/share/cr3/i18n/
2017/08/15 12:07:36.2408 ERROR Loading settings from file /home/hemant/.cr3/cr3.ini
2017/08/15 12:07:36.2566 ERROR Error opening file /usr/share/cr3/cr3hist.bmk for reading
2017/08/15 12:07:36.2578 ERROR Error opening file /home/hemant/.cr3/fb2.css for reading
2017/08/15 12:07:36.6228 ERROR CacheFile::read: Block 15:0 not found in file
Segmentation fault (core dumped)

notuxius commented on 2017-07-27 15:32

error on app start:
2017/07/27 18:31:08.8058 WARN Changing log level from 3 to 1
392 fonts loaded.
2017/07/27 18:31:08.8709 ERROR Canot load translation file cr3_en_US from dir /usr/share/cr3/i18n/
2017/07/27 18:31:08.8974 ERROR Error opening file /home/not/.cr3/cr3.ini for reading
2017/07/27 18:31:08.8975 ERROR Cannot load settings from file /home/not/.cr3/cr3.ini
Segmentation fault (core dumped)

ninian commented on 2015-10-10 19:41

@KroshKobel: Many thanks for fixing that so swiftly.

KroshKobel commented on 2015-10-10 11:38

@ninian, fixed.

ninian commented on 2015-10-08 16:36

Fails to build for me:

[ 46%] Building CXX object crengine/CMakeFiles/crengine.dir/src/lvfntman.cpp.o
/tmp/coolreader3-git/src/coolreader3-git/crengine/src/lvfntman.cpp:56:39: fatal error: freetype2/config/ftheader.h: No such file or directory
compilation terminated.
crengine/CMakeFiles/crengine.dir/build.make:494: recipe for target 'crengine/CMakeFiles/crengine.dir/src/lvfntman.cpp.o' failed
make[2]: *** [crengine/CMakeFiles/crengine.dir/src/lvfntman.cpp.o] Error 1
CMakeFiles/Makefile2:250: recipe for target 'crengine/CMakeFiles/crengine.dir/all' failed
make[1]: *** [crengine/CMakeFiles/crengine.dir/all] Error 2
Makefile:127: recipe for target 'all' failed
make: *** [all] Error 2
==> ERROR: A failure occurred in build().

But I notice freetype2 has twice been updated recently:
[2015-09-10 17:31] [ALPM] upgraded freetype2 (2.6-1 -> 2.6-2)
[2015-10-05 01:02] [ALPM] upgraded freetype2 (2.6-2 -> 2.6.1-1)

Also, the file which isn't found is listed by pacman as being at this location:
/usr/include/freetype2/freetype/config/ftheader.h
and not where the build is looking at:
/usr/include/freetype2/config/ftheader.h

KroshKobel commented on 2015-09-24 19:07

@serh, thanks for reporting the bug! I've added a patch to the package.

serh commented on 2015-09-23 14:02

Wouldn't save settings for me until I dropped a default config to .cr3/cr3.ini

wget https://dl.dropbox.com/u/8815713/mintusers/cr3/cr3.ini -O/home/`whoami`/.cr3/cr3.ini

Fixes the problem, but I think the default config could be added to the package, the bug existed for quite a while now.