Package Details: lib32-openexr 2.5.3-1

Git Clone URL: https://aur.archlinux.org/lib32-openexr.git (read-only, click to copy)
Package Base: lib32-openexr
Description: An high dynamic-range image file format library (32-bit)
Upstream URL: https://www.openexr.com/
Licenses: BSD
Conflicts: lib32-ilmbase
Replaces: lib32-ilmbase
Submitter: orumin
Maintainer: rodrigo21
Last Packager: rodrigo21
Votes: 4
Popularity: 0.007272
First Submitted: 2017-07-08 06:21
Last Updated: 2020-08-20 02:33

Latest Comments

Samega7Cattac commented on 2020-02-01 23:02

I keep building lib32-gst-plugins-bad and somehow passed IlmImftest But now it's this:

[ 97%] Linking CXX executable ../../bin/playexr
/usr/bin/ld: /usr/lib/libCgGL.so: error adding symbols: file in wrong format
collect2: error: ld returned 1 exit status
make[2]: *** [OpenEXR_Viewers/playexr/CMakeFiles/playexr.dir/build.make:204: bin/playexr] Error 1
make[1]: *** [CMakeFiles/Makefile2:1853: OpenEXR_Viewers/playexr/CMakeFiles/playexr.dir/all] Error 2
make: *** [Makefile:141: all] Error 2
==> ERROR: A failure occurred in build().
    Aborting...

Samega7Cattac commented on 2020-02-01 22:35

I'm also having that issue building it

[ 98%] Linking CXX executable ../../bin/IlmImfTest
[ 98%] Built target IlmImfTest
make: *** [Makefile:141: all] Error 2
==> ERROR: A failure occurred in build().
    Aborting...

rodrigo21 commented on 2019-10-22 15:36

@soredake It's building fine on my machine, try building on a clean chroot. And please don't mark the package as out-of-date if it's not building for you. A comment is enough.

Anonymous comment on 2019-10-22 14:53

[ 61%] Linking CXX shared library libIlmImf-2_4.so
/usr/bin/ld: /usr/lib/lib/libz.so: error adding symbols: file in wrong format
collect2: error: ld returned 1 exit status
make[2]: *** [OpenEXR/IlmImf/CMakeFiles/IlmImf.dir/build.make:1418: OpenEXR/IlmImf/libIlmImf-2_4.so.24.0.0] Error 1
make[1]: *** [CMakeFiles/Makefile2:1515: OpenEXR/IlmImf/CMakeFiles/IlmImf.dir/all] Error 2
make: *** [Makefile:141: all] Error 2
==> ERROR: A failure occurred in build().

Fails to build for me.

rodrigo21 commented on 2018-08-22 18:34

@adam900710 I'll wait until the openexr leaves the Testing repo.

I'm not using Testing, so please wait until the packages move out of testing.

adam900710 commented on 2018-08-22 06:15

https://gist.github.com/adam900710/a2e16597cc8630d934aa12a6cb59fc8d

This PKGBUILD works for me to build 2.3.0. I have added extra version check for openexr, as it needs ilmbase-2.3.0 to compile or it will just fail.