Package Details: linux-libre 4.7.6_gnu-1

Git Clone URL: (read-only)
Package Base: linux-libre
Description: The Linux-libre kernel and modules
Upstream URL:
Licenses: GPL2
Provides: linux=4.7.6
Replaces: linux
Submitter: fauno
Maintainer: Emulatorman
Last Packager: Emulatorman
Votes: 41
Popularity: 1.669805
First Submitted: 2011-08-09 21:26
Last Updated: 2016-10-01 23:35

Dependencies (12)

Required by (154)

Sources (29)

Latest Comments

xanc commented on 2016-09-18 11:34

Can anyone remove incompatibility from linux? It would allow have both: linux and linux-libre

SajeOne commented on 2016-02-15 13:45

Any ETA on a fix for the PGP sig issue?

Emulatorman commented on 2016-02-06 17:06

ok :)

JohnDVD commented on 2016-02-06 17:02

Sorry, I misstyped the key -_-

JohnDVD commented on 2016-02-06 16:55

Do you mean, I should leave out the pgp sig check?
I tried to find the key, but it seems to require a different keyserver. But I found no suitable one.

Emulatorman commented on 2016-02-06 16:48


JohnDVD commented on 2016-02-06 16:40

I have trouble with pgp signatures. It fails (unknown public key) for several files. How do I solve this?

Emulatorman commented on 2015-12-23 00:14

you're welcome onny! :)

onny commented on 2015-12-19 14:42

Okay cool, new version 4.3.3 works fine. Thanks for updating!

onny commented on 2015-12-14 14:16

Thank you for updating the package. Unfortunately I have problems compiling it:

CHK include/config/kernel.release
CHK include/generated/uapi/linux/version.h
CHK include/generated/utsrelease.h
CHK include/generated/bounds.h
CHK include/generated/timeconst.h
CHK include/generated/asm-offsets.h
CALL scripts/
CHK include/generated/compile.h
CHK kernel/config_data.h
drivers/ipack/devices/.ipoctal.o.cmd:5: *** unterminated call to function 'wildcard': missing ')'. Stop.
scripts/ recipe for target 'drivers/ipack/devices' failed
make[2]: *** [drivers/ipack/devices] Error 2
scripts/ recipe for target 'drivers/ipack' failed
make[1]: *** [drivers/ipack] Error 2
Makefile:941: recipe for target 'drivers' failed
make: *** [drivers] Error 2
make 16.34s user 5.29s system 79% cpu 27.216 total

I'll investigate into this issue ...

All comments