Package Details: noson-app 3.11.8.r0.g7180ba8-1

Git Clone URL: https://aur.archlinux.org/noson-app.git (read-only)
Package Base: noson-app
Description: The essential to control music from your SONOS devices on Linux platforms
Upstream URL: https://janbar.github.io/noson-app
Keywords: sonos
Licenses: GPL3
Groups: base-devel
Submitter: s0me0ne
Maintainer: s0me0ne
Last Packager: s0me0ne
Votes: 5
Popularity: 0.400015
First Submitted: 2018-03-04 13:20
Last Updated: 2019-05-21 19:38

Latest Comments

1 2 Next › Last »

s0me0ne commented on 2019-03-17 14:49

Thanks @janbar! :) I've added libpulse/flac as a dependency. Tests on my system showed that it works as expected.

janbar commented on 2019-03-11 23:50

I haven't tested arch yet. So if you want to enable the feature to stream the pulseaudio output, you need to add the following dependencies: - libpulse-dev - libflac-dev - libflac++-dev Unless those are already installed by default. Then in the dialog "Audio Settings" you will see the input "PulseAudio", that lets you stream YouTube or any other sounds you are playing.

s0me0ne commented on 2019-02-19 19:45

Who removes tags? oO I've just updated it to 3.10.4.

roccr commented on 2019-02-19 08:52

The right tag is 3.10.4

kubrick commented on 2019-02-19 08:36

Tag 3.10.2 doesn't exist any more therefore this package fails to build

s0me0ne commented on 2018-09-15 10:21

@ArchNemo: Sounds like your c++ compile is broken @maggu2810: Sure, just pushed an update for this while adding support for 3.8.6

maggu2810 commented on 2018-08-10 19:29

Can you please add "armv7h" to the list of supported architecures in the PKGBUILD?

I build it using the "--ignorearch" command line parameter of makepkg. The build succeeded.

Also the app itself works as expected.

Cyb3rD4d commented on 2018-07-25 07:47

Thank you, this app is awesome! I have the official app on my iPhone and it can't find the Sonos speaker on the network when Noson just works out of the box!

m8D2 commented on 2018-07-14 19:58

Hi, I got this error:

==> Starting pkgver()...
==> Starting build()...
-- The C compiler identification is GNU 8.1.1
-- The CXX compiler identification is GNU 8.1.1
-- Check for working C compiler: /usr/bin/cc
-- Check for working C compiler: /usr/bin/cc -- works
-- Detecting C compiler ABI info
-- Detecting C compiler ABI info - done
-- Detecting C compile features
-- Detecting C compile features - done
-- Check for working CXX compiler: /usr/bin/c++
-- Check for working CXX compiler: /usr/bin/c++ -- broken
CMake Error at /usr/share/cmake-3.11/Modules/CMakeTestCXXCompiler.cmake:45 (message):
The C++ compiler

"/usr/bin/c++"

is not able to compile a simple test program.

It fails with the following output:

Change Dir: /home/aaa/.cache/aurman/noson-app/src/build/CMakeFiles/CMakeTmp

Run Build Command:"/usr/bin/make" "cmTC_3b75f/fast"
/usr/bin/make -f CMakeFiles/cmTC_3b75f.dir/build.make CMakeFiles/cmTC_3b75f.dir/build
make[1]: Entering directory '/home/aaa/.cache/aurman/noson-app/src/build/CMakeFiles/CMakeTmp'
Building CXX object CMakeFiles/cmTC_3b75f.dir/testCXXCompiler.cxx.o
/usr/bin/c++    {CFLAGS}    -o CMakeFiles/cmTC_3b75f.dir/testCXXCompiler.cxx.o -c /home/aaa/.cache/aurman/noson-app/src/build/CMakeFiles/CMakeTmp/testCXXCompiler.cxx
c++: error: {CFLAGS}: No such file or directory
make[1]: *** [CMakeFiles/cmTC_3b75f.dir/build.make:66: CMakeFiles/cmTC_3b75f.dir/testCXXCompiler.cxx.o] Error 1
make[1]: Leaving directory '/home/aaa/.cache/aurman/noson-app/src/build/CMakeFiles/CMakeTmp'
make: *** [Makefile:126: cmTC_3b75f/fast] Error 2




CMake will not be able to correctly generate this project.
Call Stack (most recent call first):
CMakeLists.txt:1 (project)"

s0me0ne commented on 2018-06-14 17:50

Sorry, just updated the package to 3.4.4.