Package Details: openboardview 8.0-1

Git Clone URL: https://aur.archlinux.org/openboardview.git (read-only, click to copy)
Package Base: openboardview
Description: Linux SDL/ImGui edition software for viewing .brd files
Upstream URL: https://openboardview.org/
Licenses: MIT
Submitter: freswa
Maintainer: freswa
Last Packager: freswa
Votes: 3
Popularity: 0.000469
First Submitted: 2018-04-18 22:24
Last Updated: 2020-05-17 14:36

Latest Comments

utzlol commented on 2020-12-26 15:22

Any solution?


[ 48%] Building CXX object src/openboardview/CMakeFiles/openboardview.dir/FileFormats/BRDFile.cpp.o
/home/yudha/openboardview/src/OpenBoardView/src/openboardview/FileFormats/BRDFile.cpp: In constructor 'BRDFile::BRDFile(std::vector<char>&)':
/home/yudha/openboardview/src/OpenBoardView/src/openboardview/FileFormats/BRDFile.cpp:216:37: error: expected unqualified-id before '&' token
  216 |    } catch (const std::out_of_range &e) {
      |                                     ^
/home/yudha/openboardview/src/OpenBoardView/src/openboardview/FileFormats/BRDFile.cpp:216:36: error: expected ')' before '&' token
  216 |    } catch (const std::out_of_range &e) {
      |            ~                       ^~
      |                                    )
/home/yudha/openboardview/src/OpenBoardView/src/openboardview/FileFormats/BRDFile.cpp:216:37: error: expected '{' before '&' token
  216 |    } catch (const std::out_of_range &e) {
      |                                     ^
/home/yudha/openboardview/src/OpenBoardView/src/openboardview/FileFormats/BRDFile.cpp:216:38: error: 'e' was not declared in this scope
  216 |    } catch (const std::out_of_range &e) {
      |                                      ^
make[2]: *** [src/openboardview/CMakeFiles/openboardview.dir/build.make:212: src/openboardview/CMakeFiles/openboardview.dir/FileFormats/BRDFile.cpp.o] Error 1
make[2]: Leaving directory '/home/yudha/openboardview/src/OpenBoardView/build'
make[1]: *** [CMakeFiles/Makefile2:258: src/openboardview/CMakeFiles/openboardview.dir/all] Error 2
make[1]: Leaving directory '/home/yudha/openboardview/src/OpenBoardView/build'
make: *** [Makefile:171: all] Error 2
make: Leaving directory '/home/yudha/openboardview/src/OpenBoardView/build'
==> ERROR: A failure occurred in build().
    Aborting...

freswa commented on 2020-05-24 00:00

@flacs It's always the special variants that conflict on the regular variant, not the other way around

flacs commented on 2020-05-22 20:18

Please add openboardview-git to conflicts.

icewind commented on 2019-01-05 20:44

requires python as makedepends