Package Details: rtorrent-pyro-git 20191206-1

Git Clone URL: (read-only, click to copy)
Package Base: rtorrent-pyro-git
Description: Ncurses BitTorrent client based on libTorrent - rTorrent-git with Pyroscope patches
Upstream URL:
Keywords: pyroscope torrent
Licenses: GPL2
Conflicts: rtorrent, rtorrent-git, rtorrent-ps
Provides: rtorrent
Replaces: libtorrent-pyro-git
Submitter: skydrome
Maintainer: skydrome
Last Packager: skydrome
Votes: 28
Popularity: 0.026526
First Submitted: 2012-06-15 00:02
Last Updated: 2019-12-06 05:09

Required by (19)

Sources (10)

Latest Comments

« First ‹ Previous 1 2 3 4 5 6 7 8 Next › Last »

skydrome commented on 2015-12-20 20:50

underestimating the time i thought it would take to get that merged, ive added that patch.

Shardz commented on 2015-12-19 06:42

As a TEMPORARY FIX for people who come to this page with issues like until my pull request is resolved, my git repo fixes the errors created by &;

diff --git a/PKGBUILD b/PKGBUILD
index 0163de7..33a09c4 100644
@@ -10,7 +10,7 @@ _debug=n

pkgdesc="Ncurses BitTorrent client based on libTorrent - rTorrent-git with Pyroscope patches"
@@ -31,7 +31,7 @@ backup=('usr/share/doc/rtorrent/rtorrent.rc.sample')
_debug='--disable-debug' || options=(!strip)


Brottweiler commented on 2015-12-10 21:33

Welp, I am rebuilding libtorrent-pyro and this due to the ABI change, and this fails (as described below), so now rtorrent segfaults due to me updating libtorrent I guess, and rtorrent won't merge that PR yet :(

skydrome commented on 2015-11-18 21:20

thanks for reporting that, looks like the fix is waiting to be pulled in already.

TwoLeaves commented on 2015-11-18 13:39

Upon investigation the compile error I included in my last comment is an upstream rtorrent bug. I've reported the issue on the repo (

TwoLeaves commented on 2015-11-18 04:52

Getting this error during compilation:

g++ -DHAVE_CONFIG_H -I. -I../.. -I. -I./.. -I../.. -D_FORTIFY_SOURCE=2 -march=x86-64 -mtune=generic -O2 -pipe -fstack-protector-strong -DNDEBUG -Wall -std=c++11 -pthread -I/usr/include -MT download_factory.o -MD -MP -MF .deps/download_factory.Tpo -c -o download_factory.o In member function ‘void core::DownloadFactory::initialize_rtorrent(core::Download*, torrent::Object*)’: error: ‘const class torrent::DownloadInfo’ has no member named ‘mutable_dl_rate’
In file included from ./../rpc/command_map.h:45:0,
from ./../rpc/parse_commands.h:43,

skydrome commented on 2015-10-10 19:21

after upgrading ncurses, just recompile this package to have it relink

frriarch commented on 2015-10-10 19:04

I am getting this after updating to latest ncurses
"rtorrent: error while loading shared libraries: cannot open shared object file: No such file or directory"

At this moment I have symlink to and I know I should avoid doing it.

skydrome commented on 2015-08-18 16:01

updated the cksums

frriarch commented on 2015-08-18 14:52

I am getting this error ... FAILED
==> ERROR: One or more files did not pass the validity check!
==> ERROR: the build failed