Package Details: zdoom 2.8.1-5

Git Clone URL: https://aur.archlinux.org/zdoom.git (read-only, click to copy)
Package Base: zdoom
Description: Advanced Doom source port
Upstream URL: http://www.zdoom.org/
Licenses: BSD, LGPL, custom:dumb, custom:BUILD, custom:doom
Submitter: nvllsvm
Maintainer: grubber
Last Packager: grubber
Votes: 49
Popularity: 0.000000
First Submitted: 2008-04-15 22:44 (UTC)
Last Updated: 2017-05-09 08:03 (UTC)

Latest Comments

gameslayer commented on 2021-03-19 10:16 (UTC) (edited on 2021-03-19 10:17 (UTC) by gameslayer)

Preparing...
Cloning zdoom build files...
Checking zdoom dependencies...
Resolving dependencies...
Checking inter-conflicts...
Edit zdoom build files

Cloning zdoom build files...
Checking zdoom dependencies...
Resolving dependencies...
Checking inter-conflicts...

Building zdoom...
==> Making package: zdoom 2.8.1-5 (Fri 19 Mar 2021 08:11:10 PM AEST)
==> Checking runtime dependencies...
==> Checking buildtime dependencies...
==> Retrieving sources...
  -> Downloading zdoom-2.8.1-src.7z...
  % Total    % Received % Xferd  Average Speed   Time    Time     Time  Current
                                 Dload  Upload   Total   Spent    Left  Speed

  0     0    0     0    0     0      0      0 --:--:-- --:--:-- --:--:--     0
100   169  100   169    0     0    236      0 --:--:-- --:--:-- --:--:--   236
100   169  100   169    0     0    236      0 --:--:-- --:--:-- --:--:--   236

  0     0    0     0    0     0      0      0 --:--:--  0:00:01 --:--:--     0
 13 3091k   13  431k    0     0   160k      0  0:00:19  0:00:02  0:00:17  450k
 61 3091k   61 1887k    0     0   529k      0  0:00:05  0:00:03  0:00:02 1030k
100 3091k  100 3091k    0     0   776k      0  0:00:03  0:00:03 --:--:-- 1375k
  -> Found zdoom.desktop
  -> Found 0001-Improve-Mac-GCC-errors-fix-to-work-only-for-GCC.patch
==> Validating source files with sha256sums...
    zdoom-2.8.1-src.7z ... Passed
    zdoom.desktop ... Passed
    0001-Improve-Mac-GCC-errors-fix-to-work-only-for-GCC.patch ... Passed
==> Removing existing $srcdir/ directory...
==> Extracting sources...
==> Starting prepare()...
patching file dumb/CMakeLists.txt
patching file src/CMakeLists.txt
==> Starting build()...
CMake Deprecation Warning at CMakeLists.txt:1 (cmake_minimum_required):
  Compatibility with CMake < 2.8.12 will be removed from a future version of
  CMake.

  Update the VERSION argument <min> value or use a ...<max> suffix to tell
  CMake that the project does not need compatibility with older versions.


-- The C compiler identification is GNU 10.2.0
-- The CXX compiler identification is GNU 10.2.0
-- Detecting C compiler ABI info
-- Detecting C compiler ABI info - done
-- Check for working C compiler: /usr/bin/cc - skipped
-- Detecting C compile features
-- Detecting C compile features - done
-- Detecting CXX compiler ABI info
-- Detecting CXX compiler ABI info - done
-- Check for working CXX compiler: /usr/bin/c++ - skipped
-- Detecting CXX compile features
-- Detecting CXX compile features - done
CMake Deprecation Warning at CreateLaunchers.cmake:48 (cmake_policy):
  The OLD behavior for policy CMP0026 will be removed from a future version
  of CMake.

  The cmake-policies(7) manual explains that the OLD behaviors of all
  policies are deprecated and that a policy should be set to OLD only under
  specific short-term circumstances.  Projects should be ported to the NEW
  behavior and not rely on setting a policy to OLD.
Call Stack (most recent call first):
  CMakeLists.txt:14 (include)


-- Found BZip2: /usr/lib/libbz2.so (found version "1.0.8") 
-- Looking for BZ2_bzCompressInit
-- Looking for BZ2_bzCompressInit - found
-- Found JPEG: /usr/lib/libjpeg.so (found version "80") 
-- Found ZLIB: /usr/lib/libz.so (found version "1.2.11") 
-- Found GME: /usr/lib/libgme.so  
-- Using system zlib
-- Using system jpeg library
-- Using system bzip2 library
-- Using system gme library /usr/include/gme
CMake Deprecation Warning at lzma/CMakeLists.txt:1 (cmake_minimum_required):
  Compatibility with CMake < 2.8.12 will be removed from a future version of
  CMake.

  Update the VERSION argument <min> value or use a ...<max> suffix to tell
  CMake that the project does not need compatibility with older versions.


CMake Deprecation Warning at tools/CMakeLists.txt:1 (cmake_minimum_required):
  Compatibility with CMake < 2.8.12 will be removed from a future version of
  CMake.

  Update the VERSION argument <min> value or use a ...<max> suffix to tell
  CMake that the project does not need compatibility with older versions.


CMake Deprecation Warning at tools/lemon/CMakeLists.txt:1 (cmake_minimum_required):
  Compatibility with CMake < 2.8.12 will be removed from a future version of
  CMake.

  Update the VERSION argument <min> value or use a ...<max> suffix to tell
  CMake that the project does not need compatibility with older versions.


CMake Deprecation Warning at tools/re2c/CMakeLists.txt:1 (cmake_minimum_required):
  Compatibility with CMake < 2.8.12 will be removed from a future version of
  CMake.

  Update the VERSION argument <min> value or use a ...<max> suffix to tell
  CMake that the project does not need compatibility with older versions.


-- Looking for strdup
-- Looking for strdup - found
-- Looking for strndup
-- Looking for strndup - found
-- Looking for sys/types.h
-- Looking for sys/types.h - found
-- Looking for stdint.h
-- Looking for stdint.h - found
-- Looking for stddef.h
-- Looking for stddef.h - found
-- Check size of char
-- Check size of char - done
-- Check size of short
-- Check size of short - done
-- Check size of int
-- Check size of int - done
-- Check size of long
-- Check size of long - done
CMake Deprecation Warning at tools/updaterevision/CMakeLists.txt:1 (cmake_minimum_required):
  Compatibility with CMake < 2.8.12 will be removed from a future version of
  CMake.

  Update the VERSION argument <min> value or use a ...<max> suffix to tell
  CMake that the project does not need compatibility with older versions.


CMake Deprecation Warning at tools/zipdir/CMakeLists.txt:1 (cmake_minimum_required):
  Compatibility with CMake < 2.8.12 will be removed from a future version of
  CMake.

  Update the VERSION argument <min> value or use a ...<max> suffix to tell
  CMake that the project does not need compatibility with older versions.


-- /usr/include
-- /usr/include
-- /var/tmp/pamac-build-corey/zdoom/src/zdoom/lzma/C
CMake Deprecation Warning at dumb/CMakeLists.txt:1 (cmake_minimum_required):
  Compatibility with CMake < 2.8.12 will be removed from a future version of
  CMake.

  Update the VERSION argument <min> value or use a ...<max> suffix to tell
  CMake that the project does not need compatibility with older versions.


CMake Warning (dev) in dumb/CMakeLists.txt:
  A logical block opening on the line

    /var/tmp/pamac-build-corey/zdoom/src/zdoom/dumb/CMakeLists.txt:12 (if)

  closes on the line

    /var/tmp/pamac-build-corey/zdoom/src/zdoom/dumb/CMakeLists.txt:14 (endif)

  with mis-matching arguments.
This warning is for project developers.  Use -Wno-dev to suppress it.

-- Looking for itoa
-- Looking for itoa - not found
-- Performing Test DUMB_CAN_USE_SSE
-- Performing Test DUMB_CAN_USE_SSE - Failed
CMake Deprecation Warning at gdtoa/CMakeLists.txt:1 (cmake_minimum_required):
  Compatibility with CMake < 2.8.12 will be removed from a future version of
  CMake.

  Update the VERSION argument <min> value or use a ...<max> suffix to tell
  CMake that the project does not need compatibility with older versions.


CMake Deprecation Warning at wadsrc/CMakeLists.txt:1 (cmake_minimum_required):
  Compatibility with CMake < 2.8.12 will be removed from a future version of
  CMake.

  Update the VERSION argument <min> value or use a ...<max> suffix to tell
  CMake that the project does not need compatibility with older versions.


CMake Deprecation Warning at src/CMakeLists.txt:1 (cmake_minimum_required):
  Compatibility with CMake < 2.8.12 will be removed from a future version of
  CMake.

  Update the VERSION argument <min> value or use a ...<max> suffix to tell
  CMake that the project does not need compatibility with older versions.


-- Found PkgConfig: /usr/bin/pkg-config (found version "1.7.3") 
-- Checking for module 'gtk+-2.0'
--   Found gtk+-2.0, version 2.24.33
-- Looking for pthread.h
-- Looking for pthread.h - found
-- Performing Test CMAKE_HAVE_LIBC_PTHREAD
-- Performing Test CMAKE_HAVE_LIBC_PTHREAD - Failed
-- Looking for pthread_create in pthreads
-- Looking for pthread_create in pthreads - not found
-- Looking for pthread_create in pthread
-- Looking for pthread_create in pthread - found
-- Found Threads: TRUE  
-- Found SDL2: /usr/lib/libSDL2main.a;/usr/lib/libSDL2.so;-lpthread  
-- Found OpenAL: /usr/lib/libopenal.so  
-- Found SndFile: /usr/lib/libsndfile.so  
-- Found MPG123: /usr/lib/libmpg123.so  
-- Found FluidSynth: /usr/lib/libfluidsynth.so  
-- Selected assembler: /usr/bin/as
CMake Warning (dev) in src/CMakeLists.txt:
  A logical block opening on the line

    /var/tmp/pamac-build-corey/zdoom/src/zdoom/src/CMakeLists.txt:461 (if)

  closes on the line

    /var/tmp/pamac-build-corey/zdoom/src/zdoom/src/CMakeLists.txt:464 (endif)

  with mis-matching arguments.
This warning is for project developers.  Use -Wno-dev to suppress it.

-- Looking for filelength
-- Looking for filelength - not found
-- Looking for strupr
-- Looking for strupr - not found
-- Looking for stricmp
-- Looking for stricmp - not found
-- Looking for strnicmp
-- Looking for strnicmp - not found
-- Looking for clock_gettime in rt
-- Looking for clock_gettime in rt - found
-- Performing Test HAS_VA_COPY
-- Performing Test HAS_VA_COPY - Success
-- Fluid synth libs: /usr/lib/libfluidsynth.so
CMake Deprecation Warning at output_sdl/CMakeLists.txt:1 (cmake_minimum_required):
  Compatibility with CMake < 2.8.12 will be removed from a future version of
  CMake.

  Update the VERSION argument <min> value or use a ...<max> suffix to tell
  CMake that the project does not need compatibility with older versions.


-- Configuring done
-- Generating done
-- Build files have been written to: /var/tmp/pamac-build-corey/zdoom/src/zdoom
Scanning dependencies of target updaterevision
Scanning dependencies of target lemon
Scanning dependencies of target re2c
Scanning dependencies of target lzma
[  0%] Building C object tools/updaterevision/CMakeFiles/updaterevision.dir/updaterevision.o
[  1%] Building C object tools/lemon/CMakeFiles/lemon.dir/lemon.o
[  1%] Building CXX object tools/re2c/CMakeFiles/re2c.dir/actions.o
Scanning dependencies of target dumb
[  1%] Building C object lzma/CMakeFiles/lzma.dir/C/7zArcIn.o
[  1%] Building C object dumb/CMakeFiles/dumb.dir/src/core/unload.o
[  1%] Linking C executable updaterevision
[  1%] Building C object dumb/CMakeFiles/dumb.dir/src/core/rendsig.o
[  1%] Built target updaterevision
Scanning dependencies of target arithchk
[  1%] Building C object gdtoa/CMakeFiles/arithchk.dir/arithchk.o
[  1%] Linking C executable arithchk
[  2%] Building C object dumb/CMakeFiles/dumb.dir/src/core/rendduh.o
[  2%] Built target arithchk
Scanning dependencies of target revision_check
fatal: No names found, cannot describe anything.
Failed to get commit info: Success
[  2%] Built target revision_check
[  2%] Generating arith.h
Scanning dependencies of target qnan
[  3%] Building C object gdtoa/CMakeFiles/qnan.dir/qnan.o
[  3%] Linking C executable qnan
[  3%] Built target qnan
[  4%] Generating gd_qnan.h
[  4%] Building C object dumb/CMakeFiles/dumb.dir/src/core/register.o
Scanning dependencies of target gdtoa
[  4%] Building C object gdtoa/CMakeFiles/gdtoa.dir/dmisc.o
[  4%] Building C object dumb/CMakeFiles/dumb.dir/src/core/readduh.o
[  4%] Building C object gdtoa/CMakeFiles/gdtoa.dir/dtoa.o
[  4%] Building C object dumb/CMakeFiles/dumb.dir/src/core/rawsig.o
[  4%] Building C object dumb/CMakeFiles/dumb.dir/src/core/makeduh.o
[  4%] Building C object gdtoa/CMakeFiles/gdtoa.dir/misc.o
[  5%] Building C object dumb/CMakeFiles/dumb.dir/src/core/loadduh.o
[  5%] Building C object dumb/CMakeFiles/dumb.dir/src/core/dumbfile.o
[  5%] Building C object lzma/CMakeFiles/lzma.dir/C/7zBuf.o
[  5%] Building C object dumb/CMakeFiles/dumb.dir/src/core/duhtag.o
[  6%] Building C object lzma/CMakeFiles/lzma.dir/C/7zCrc.o
[  6%] Building C object dumb/CMakeFiles/dumb.dir/src/core/duhlen.o
[  6%] Linking C static library libgdtoa.a
[  6%] Building C object lzma/CMakeFiles/lzma.dir/C/7zCrcOpt.o
[  7%] Building C object dumb/CMakeFiles/dumb.dir/src/core/atexit.o
[  7%] Building C object lzma/CMakeFiles/lzma.dir/C/7zDec.o
[  7%] Built target gdtoa
[  7%] Building C object dumb/CMakeFiles/dumb.dir/src/helpers/stdfile.o
[  7%] Building C object dumb/CMakeFiles/dumb.dir/src/helpers/silence.o
[  7%] Building C object dumb/CMakeFiles/dumb.dir/src/helpers/sampbuf.o
[  7%] Building C object dumb/CMakeFiles/dumb.dir/src/helpers/riff.o
[  8%] Building C object dumb/CMakeFiles/dumb.dir/src/helpers/resample.o
[  8%] Building C object dumb/CMakeFiles/dumb.dir/src/helpers/memfile.o
[  8%] Building C object dumb/CMakeFiles/dumb.dir/src/helpers/clickrem.o
[  8%] Building C object lzma/CMakeFiles/lzma.dir/C/7zStream.o
[  8%] Building C object lzma/CMakeFiles/lzma.dir/C/Bcj2.o
[  9%] Building C object lzma/CMakeFiles/lzma.dir/C/Bra.o
[  9%] Building C object dumb/CMakeFiles/dumb.dir/src/helpers/barray.o
[  9%] Building C object lzma/CMakeFiles/lzma.dir/C/Bra86.o
[  9%] Building C object dumb/CMakeFiles/dumb.dir/src/it/xmeffect.o
[ 10%] Building C object dumb/CMakeFiles/dumb.dir/src/it/readxm2.o
[ 10%] Building C object lzma/CMakeFiles/lzma.dir/C/BraIA64.o
[ 10%] Building C object dumb/CMakeFiles/dumb.dir/src/it/readxm.o
[ 10%] Building C object lzma/CMakeFiles/lzma.dir/C/CpuArch.o
[ 10%] Building C object lzma/CMakeFiles/lzma.dir/C/Delta.o
/var/tmp/pamac-build-corey/zdoom/src/zdoom/dumb/src/it/readxm.c: In function ‘it_xm_load_sigdata’:
/var/tmp/pamac-build-corey/zdoom/src/zdoom/dumb/src/it/readxm.c:1009:5: warning: this ‘if’ clause does not guard... [-Wmisleading-indentation]
 1009 |     if (sigdata->n_orders == 0)
      |     ^~
/var/tmp/pamac-build-corey/zdoom/src/zdoom/dumb/src/it/readxm.c:1014:2: note: ...this statement, but the latter is misleadingly indented as if it were guarded by the ‘if’
 1014 |  i = header_size - 4 - 2 * 8; /* Maximum number of orders expected */
      |  ^
[ 11%] Building C object lzma/CMakeFiles/lzma.dir/C/LzFind.o
[ 11%] Building CXX object tools/re2c/CMakeFiles/re2c.dir/code.o
[ 11%] Linking C executable lemon
[ 11%] Building C object lzma/CMakeFiles/lzma.dir/C/Lzma2Dec.o
[ 11%] Building C object lzma/CMakeFiles/lzma.dir/C/LzmaDec.o
[ 11%] Building C object dumb/CMakeFiles/dumb.dir/src/it/readstm2.o
[ 11%] Building C object dumb/CMakeFiles/dumb.dir/src/it/readstm.o
/var/tmp/pamac-build-corey/zdoom/src/zdoom/tools/lemon
[ 11%] Building CXX object tools/re2c/CMakeFiles/re2c.dir/dfa.o
[ 12%] Building C object dumb/CMakeFiles/dumb.dir/src/it/reads3m2.o
[ 12%] Building C object dumb/CMakeFiles/dumb.dir/src/it/reads3m.o
[ 12%] Built target lemon
[ 12%] Building C object dumb/CMakeFiles/dumb.dir/src/it/readriff.o
[ 12%] Building C object dumb/CMakeFiles/dumb.dir/src/it/readptm.o
[ 12%] Building C object dumb/CMakeFiles/dumb.dir/src/it/readpsm.o
[ 12%] Building C object lzma/CMakeFiles/lzma.dir/C/LzmaEnc.o
[ 13%] Building C object lzma/CMakeFiles/lzma.dir/C/Ppmd7.o
[ 14%] Building CXX object tools/re2c/CMakeFiles/re2c.dir/main.o
[ 15%] Building C object dumb/CMakeFiles/dumb.dir/src/it/readoldpsm.o
[ 15%] Building C object lzma/CMakeFiles/lzma.dir/C/Ppmd7Dec.o
[ 15%] Building C object dumb/CMakeFiles/dumb.dir/src/it/readokt2.o
[ 15%] Building C object dumb/CMakeFiles/dumb.dir/src/it/readokt.o
[ 15%] Building C object dumb/CMakeFiles/dumb.dir/src/it/readmtm.o
[ 15%] Linking C static library liblzma.a
[ 15%] Built target lzma
Scanning dependencies of target zipdir
[ 15%] Building C object tools/zipdir/CMakeFiles/zipdir.dir/zipdir.o
[ 15%] Building C object dumb/CMakeFiles/dumb.dir/src/it/readmod2.o
[ 16%] Building C object dumb/CMakeFiles/dumb.dir/src/it/readmod.o
/var/tmp/pamac-build-corey/zdoom/src/zdoom/dumb/src/it/readmod.c: In function ‘it_mod_load_sigdata’:
/var/tmp/pamac-build-corey/zdoom/src/zdoom/dumb/src/it/readmod.c:291:5: warning: this ‘if’ clause does not guard... [-Wmisleading-indentation]
  291 |     if ( dumbfile_seek(f, 0, DFS_SEEK_SET) )
      |     ^~
/var/tmp/pamac-build-corey/zdoom/src/zdoom/dumb/src/it/readmod.c:294:2: note: ...this statement, but the latter is misleadingly indented as if it were guarded by the ‘if’
  294 |  sigdata = malloc(sizeof(*sigdata));
      |  ^~~~~~~
[ 16%] Building C object dumb/CMakeFiles/dumb.dir/src/it/readdsmf.o
[ 16%] Building C object dumb/CMakeFiles/dumb.dir/src/it/readasy.o
[ 16%] Building C object dumb/CMakeFiles/dumb.dir/src/it/readamf2.o
[ 16%] Building CXX object tools/re2c/CMakeFiles/re2c.dir/mbo_getopt.o
[ 16%] Building CXX object tools/re2c/CMakeFiles/re2c.dir/parser.o
[ 17%] Linking C executable zipdir
[ 18%] Building C object dumb/CMakeFiles/dumb.dir/src/it/readamf.o
[ 18%] Building C object dumb/CMakeFiles/dumb.dir/src/it/readam.o
[ 18%] Building C object dumb/CMakeFiles/dumb.dir/src/it/read6692.o
[ 18%] Building CXX object tools/re2c/CMakeFiles/re2c.dir/scanner.o
[ 18%] Building C object dumb/CMakeFiles/dumb.dir/src/it/read669.o
[ 18%] Built target zipdir
[ 19%] Building CXX object tools/re2c/CMakeFiles/re2c.dir/substr.o
[ 19%] Building CXX object tools/re2c/CMakeFiles/re2c.dir/translate.o
[ 20%] Building C object dumb/CMakeFiles/dumb.dir/src/it/loadxm2.o
[ 19%] Building C object dumb/CMakeFiles/dumb.dir/src/it/ptmeffect.o
[ 20%] Building C object dumb/CMakeFiles/dumb.dir/src/it/loadxm.o
[ 20%] Building C object dumb/CMakeFiles/dumb.dir/src/it/loadstm2.o
[ 20%] Building C object dumb/CMakeFiles/dumb.dir/src/it/loadstm.o
[ 20%] Building C object dumb/CMakeFiles/dumb.dir/src/it/loads3m2.o
[ 21%] Building C object dumb/CMakeFiles/dumb.dir/src/it/loads3m.o
[ 21%] Building C object dumb/CMakeFiles/dumb.dir/src/it/loadriff2.o
[ 21%] Building C object dumb/CMakeFiles/dumb.dir/src/it/loadriff.o
[ 21%] Building C object dumb/CMakeFiles/dumb.dir/src/it/loadptm2.o
[ 22%] Building C object dumb/CMakeFiles/dumb.dir/src/it/loadptm.o
[ 22%] Building C object dumb/CMakeFiles/dumb.dir/src/it/loadpsm2.o
[ 22%] Building C object dumb/CMakeFiles/dumb.dir/src/it/loadpsm.o
[ 22%] Building C object dumb/CMakeFiles/dumb.dir/src/it/loadoldpsm2.o
[ 23%] Building C object dumb/CMakeFiles/dumb.dir/src/it/loadoldpsm.o
[ 23%] Building C object dumb/CMakeFiles/dumb.dir/src/it/loadokt2.o
[ 23%] Building C object dumb/CMakeFiles/dumb.dir/src/it/loadokt.o
[ 23%] Building C object dumb/CMakeFiles/dumb.dir/src/it/loadmtm2.o
[ 23%] Building C object dumb/CMakeFiles/dumb.dir/src/it/loadmtm.o
[ 23%] Building C object dumb/CMakeFiles/dumb.dir/src/it/loadmod2.o
[ 24%] Building C object dumb/CMakeFiles/dumb.dir/src/it/loadmod.o
[ 24%] Building C object dumb/CMakeFiles/dumb.dir/src/it/loadasy2.o
[ 24%] Building C object dumb/CMakeFiles/dumb.dir/src/it/loadasy.o
[ 24%] Building C object dumb/CMakeFiles/dumb.dir/src/it/loadamf2.o
[ 25%] Building C object dumb/CMakeFiles/dumb.dir/src/it/loadamf.o
[ 25%] Building C object dumb/CMakeFiles/dumb.dir/src/it/load6692.o
[ 25%] Linking CXX executable re2c
[ 25%] Building C object dumb/CMakeFiles/dumb.dir/src/it/itunload.o
[ 25%] Building C object dumb/CMakeFiles/dumb.dir/src/it/load669.o
[ 25%] Building C object dumb/CMakeFiles/dumb.dir/src/it/itrender.o
[ 26%] Building C object dumb/CMakeFiles/dumb.dir/src/it/itread2.o
[ 26%] Building C object dumb/CMakeFiles/dumb.dir/src/it/itread.o
[ 26%] Building C object dumb/CMakeFiles/dumb.dir/src/it/itorder.o
/var/tmp/pamac-build-corey/zdoom/src/zdoom/dumb/src/it/itread.c: In function ‘_dumb_it_read_sample_data_adpcm4’:
/var/tmp/pamac-build-corey/zdoom/src/zdoom/dumb/src/it/itread.c:624:5: warning: this ‘if’ clause does not guard... [-Wmisleading-indentation]
  624 |     if (dumbfile_getnc((char *)compression_table, 16, f) != 16)
      |     ^~
/var/tmp/pamac-build-corey/zdoom/src/zdoom/dumb/src/it/itread.c:626:2: note: ...this statement, but the latter is misleadingly indented as if it were guarded by the ‘if’
  626 |  ptr = (signed char *) sample->data;
      |  ^~~
[ 26%] Building C object dumb/CMakeFiles/dumb.dir/src/it/itmisc.o
[ 26%] Built target re2c
[ 26%] Building C object dumb/CMakeFiles/dumb.dir/src/it/itload2.o
[ 27%] Building C object dumb/CMakeFiles/dumb.dir/src/it/itload.o
[ 27%] Building C object dumb/CMakeFiles/dumb.dir/src/it/readany.o
[ 27%] Building C object dumb/CMakeFiles/dumb.dir/src/it/loadany2.o
[ 27%] Building C object dumb/CMakeFiles/dumb.dir/src/it/loadany.o
[ 28%] Building C object dumb/CMakeFiles/dumb.dir/src/it/readany2.o
[ 28%] Building C object dumb/CMakeFiles/dumb.dir/src/helpers/resampler.o
[ 28%] Building C object dumb/CMakeFiles/dumb.dir/src/helpers/lpc.o
[ 28%] Linking C static library libdumb.a
[ 28%] Built target dumb
[ 28%] Generating xlat_parser.c, xlat_parser.h
[ 28%] Generating CMakeFiles/zdoom.dir/asm_x86_64/tmap3.o
[ 29%] Generating sc_man_scanner.h
/var/tmp/pamac-build-corey/zdoom/src/zdoom/src/asm_x86_64/tmap3.s: Assembler messages:
/var/tmp/pamac-build-corey/zdoom/src/zdoom/src/asm_x86_64/tmap3.s:7: Error: unknown mnemonic `movl' -- `movl dc_pitch(%rip),%ecx'
/var/tmp/pamac-build-corey/zdoom/src/zdoom/src/asm_x86_64/tmap3.s:8: Error: unknown mnemonic `movl' -- `movl %ecx,pm+3(%rip)'
/var/tmp/pamac-build-corey/zdoom/src/zdoom/src/asm_x86_64/tmap3.s:9: Error: unknown mnemonic `movl' -- `movl %ecx,vltpitch+3(%rip)'
/var/tmp/pamac-build-corey/zdoom/src/zdoom/src/asm_x86_64/tmap3.s:16: Error: unknown mnemonic `movb' -- `movb %dil,shifter1+2(%rip)'
/var/tmp/pamac-build-corey/zdoom/src/zdoom/src/asm_x86_64/tmap3.s:17: Error: unknown mnemonic `movb' -- `movb %dil,shifter2+2(%rip)'
/var/tmp/pamac-build-corey/zdoom/src/zdoom/src/asm_x86_64/tmap3.s:18: Error: unknown mnemonic `movb' -- `movb %dil,shifter3+2(%rip)'
/var/tmp/pamac-build-corey/zdoom/src/zdoom/src/asm_x86_64/tmap3.s:19: Error: unknown mnemonic `movb' -- `movb %dil,shifter4+2(%rip)'
/var/tmp/pamac-build-corey/zdoom/src/zdoom/src/asm_x86_64/tmap3.s:30: Error: unknown mnemonic `push' -- `push %rbx'
/var/tmp/pamac-build-corey/zdoom/src/zdoom/src/asm_x86_64/tmap3.s:31: Error: unknown mnemonic `push' -- `push %rdi'
/var/tmp/pamac-build-corey/zdoom/src/zdoom/src/asm_x86_64/tmap3.s:32: Error: unknown mnemonic `push' -- `push %r15'
/var/tmp/pamac-build-corey/zdoom/src/zdoom/src/asm_x86_64/tmap3.s:33: Error: unknown mnemonic `push' -- `push %r14'
/var/tmp/pamac-build-corey/zdoom/src/zdoom/src/asm_x86_64/tmap3.s:34: Error: unknown mnemonic `push' -- `push %r13'
/var/tmp/pamac-build-corey/zdoom/src/zdoom/src/asm_x86_64/tmap3.s:35: Error: unknown mnemonic `push' -- `push %r12'
/var/tmp/pamac-build-corey/zdoom/src/zdoom/src/asm_x86_64/tmap3.s:36: Error: unknown mnemonic `push' -- `push %rbp'
/var/tmp/pamac-build-corey/zdoom/src/zdoom/src/asm_x86_64/tmap3.s:37: Error: unknown mnemonic `push' -- `push %rsi'
/var/tmp/pamac-build-corey/zdoom/src/zdoom/src/asm_x86_64/tmap3.s:38: Error: unknown mnemonic `subq' -- `subq $8,%rsp#Does the stack need to be 16-byte aligned for Linux?'
/var/tmp/pamac-build-corey/zdoom/src/zdoom/src/asm_x86_64/tmap3.s:49: Error: unknown mnemonic `movl' -- `movl dc_count(%rip),%ecx'
/var/tmp/pamac-build-corey/zdoom/src/zdoom/src/asm_x86_64/tmap3.s:50: Error: unknown mnemonic `movq' -- `movq dc_dest(%rip),%rdi'
/var/tmp/pamac-build-corey/zdoom/src/zdoom/src/asm_x86_64/tmap3.s:51: Error: unknown mnemonic `testl' -- `testl %ecx,%ecx'
/var/tmp/pamac-build-corey/zdoom/src/zdoom/src/asm_x86_64/tmap3.s:52: Error: unknown mnemonic `jle' -- `jle vltepilog#count must be positive'
/var/tmp/pamac-build-corey/zdoom/src/zdoom/src/asm_x86_64/tmap3.s:54: Error: unknown mnemonic `movq' -- `movq bufplce(%rip),%rax'
/var/tmp/pamac-build-corey/zdoom/src/zdoom/src/asm_x86_64/tmap3.s:55: Error: unknown mnemonic `movq' -- `movq bufplce+8(%rip),%r8'
/var/tmp/pamac-build-corey/zdoom/src/zdoom/src/asm_x86_64/tmap3.s:56: Error: unknown mnemonic `subq' -- `subq %rax,%r8'
/var/tmp/pamac-build-corey/zdoom/src/zdoom/src/asm_x86_64/tmap3.s:57: Error: unknown mnemonic `movq' -- `movq bufplce+16(%rip),%r9'
/var/tmp/pamac-build-corey/zdoom/src/zdoom/src/asm_x86_64/tmap3.s:58: Error: unknown mnemonic `subq' -- `subq %rax,%r9'
/var/tmp/pamac-build-corey/zdoom/src/zdoom/src/asm_x86_64/tmap3.s:59: Error: unknown mnemonic `movq' -- `movq bufplce+24(%rip),%r10'
/var/tmp/pamac-build-corey/zdoom/src/zdoom/src/asm_x86_64/tmap3.s:60: Error: unknown mnemonic `subq' -- `subq %rax,%r10'
/var/tmp/pamac-build-corey/zdoom/src/zdoom/src/asm_x86_64/tmap3.s:61: Error: unknown mnemonic `movl' -- `movl %r8d,source2+4(%rip)'
/var/tmp/pamac-build-corey/zdoom/src/zdoom/src/asm_x86_64/tmap3.s:62: Error: unknown mnemonic `movl' -- `movl %r9d,source3+4(%rip)'
/var/tmp/pamac-build-corey/zdoom/src/zdoom/src/asm_x86_64/tmap3.s:63: Error: unknown mnemonic `movl' -- `movl %r10d,source4+4(%rip)'
/var/tmp/pamac-build-corey/zdoom/src/zdoom/src/asm_x86_64/tmap3.s:65: Error: unknown mnemonic `imulq' -- `imulq $320,%rcx'
/var/tmp/pamac-build-corey/zdoom/src/zdoom/src/asm_x86_64/tmap3.s:67: Error: unknown mnemonic `movq' -- `movq palookupoffse(%rip),%r12'
/var/tmp/pamac-build-corey/zdoom/src/zdoom/src/asm_x86_64/tmap3.s:68: Error: unknown mnemonic `movq' -- `movq palookupoffse+8(%rip),%r13'
/var/tmp/pamac-build-corey/zdoom/src/zdoom/src/asm_x86_64/tmap3.s:69: Error: unknown mnemonic `movq' -- `movq palookupoffse+16(%rip),%r14'
/var/tmp/pamac-build-corey/zdoom/src/zdoom/src/asm_x86_64/tmap3.s:70: Error: unknown mnemonic `movq' -- `movq palookupoffse+24(%rip),%r15'
/var/tmp/pamac-build-corey/zdoom/src/zdoom/src/asm_x86_64/tmap3.s:72: Error: unknown mnemonic `movl' -- `movl vince(%rip),%r8d'
/var/tmp/pamac-build-corey/zdoom/src/zdoom/src/asm_x86_64/tmap3.s:73: Error: unknown mnemonic `movl' -- `movl vince+4(%rip),%r9d'
/var/tmp/pamac-build-corey/zdoom/src/zdoom/src/asm_x86_64/tmap3.s:74: Error: unknown mnemonic `movl' -- `movl vince+8(%rip),%r10d'
/var/tmp/pamac-build-corey/zdoom/src/zdoom/src/asm_x86_64/tmap3.s:75: Error: unknown mnemonic `movl' -- `movl vince+12(%rip),%r11d'
/var/tmp/pamac-build-corey/zdoom/src/zdoom/src/asm_x86_64/tmap3.s:76: Error: unknown mnemonic `movl' -- `movl %r8d,step1+3(%rip)'
/var/tmp/pamac-build-corey/zdoom/src/zdoom/src/asm_x86_64/tmap3.s:77: Error: unknown mnemonic `movl' -- `movl %r9d,step2+3(%rip)'
/var/tmp/pamac-build-corey/zdoom/src/zdoom/src/asm_x86_64/tmap3.s:78: Error: unknown mnemonic `movl' -- `movl %r10d,step3+3(%rip)'
/var/tmp/pamac-build-corey/zdoom/src/zdoom/src/asm_x86_64/tmap3.s:79: Error: unknown mnemonic `movl' -- `movl %r11d,step4+3(%rip)'
/var/tmp/pamac-build-corey/zdoom/src/zdoom/src/asm_x86_64/tmap3.s:81: Error: unknown mnemonic `addq' -- `addq %rcx,%rdi'
/var/tmp/pamac-build-corey/zdoom/src/zdoom/src/asm_x86_64/tmap3.s:82: Error: unknown mnemonic `negq' -- `negq %rcx'
/var/tmp/pamac-build-corey/zdoom/src/zdoom/src/asm_x86_64/tmap3.s:84: Error: unknown mnemonic `movl' -- `movl vplce(%rip),%r8d'
/var/tmp/pamac-build-corey/zdoom/src/zdoom/src/asm_x86_64/tmap3.s:85: Error: unknown mnemonic `movl' -- `movl vplce+4(%rip),%r9d'
/var/tmp/pamac-build-corey/zdoom/src/zdoom/src/asm_x86_64/tmap3.s:86: Error: unknown mnemonic `movl' -- `movl vplce+8(%rip),%r10d'
/var/tmp/pamac-build-corey/zdoom/src/zdoom/src/asm_x86_64/tmap3.s:87: Error: unknown mnemonic `movl' -- `movl vplce+12(%rip),%r11d'
/var/tmp/pamac-build-corey/zdoom/src/zdoom/src/asm_x86_64/tmap3.s:89: Error: unknown mnemonic `jmp' -- `jmp loopit'
/var/tmp/pamac-build-corey/zdoom/src/zdoom/src/asm_x86_64/tmap3.s:93: Error: unknown mnemonic `movl' -- `movl %r8d,%edx'
/var/tmp/pamac-build-corey/zdoom/src/zdoom/src/asm_x86_64/tmap3.s:94: Error: unknown mnemonic `shrl' -- `shrl $24,%edx'
/var/tmp/pamac-build-corey/zdoom/src/zdoom/src/asm_x86_64/tmap3.s:95: Error: unknown mnemonic `addl' -- `addl $0x44444444,%r8d'
/var/tmp/pamac-build-corey/zdoom/src/zdoom/src/asm_x86_64/tmap3.s:96: Error: unknown mnemonic `movzbl' -- `movzbl (%rax,%rdx),%edx'
/var/tmp/pamac-build-corey/zdoom/src/zdoom/src/asm_x86_64/tmap3.s:97: Error: unknown mnemonic `movl' -- `movl %r9d,%ebx'
/var/tmp/pamac-build-corey/zdoom/src/zdoom/src/asm_x86_64/tmap3.s:98: Error: unknown mnemonic `movb' -- `movb (%r12,%rdx),%dl'
/var/tmp/pamac-build-corey/zdoom/src/zdoom/src/asm_x86_64/tmap3.s:99: Error: unknown mnemonic `shrl' -- `shrl $24,%ebx'
/var/tmp/pamac-build-corey/zdoom/src/zdoom/src/asm_x86_64/tmap3.s:100: Error: unknown mnemonic `addl' -- `addl $0x44444444,%r9d'
/var/tmp/pamac-build-corey/zdoom/src/zdoom/src/asm_x86_64/tmap3.s:101: Error: unknown mnemonic `movzbl' -- `movzbl 0x44444444(%rax,%rbx),%ebx'
/var/tmp/pamac-build-corey/zdoom/src/zdoom/src/asm_x86_64/tmap3.s:102: Error: unknown mnemonic `movl' -- `movl %r10d,%ebp'
/var/tmp/pamac-build-corey/zdoom/src/zdoom/src/asm_x86_64/tmap3.s:103: Error: unknown mnemonic `movb' -- `movb (%r13,%rbx),%bl'
/var/tmp/pamac-build-corey/zdoom/src/zdoom/src/asm_x86_64/tmap3.s:104: Error: unknown mnemonic `shr' -- `shr $24,%ebp'
/var/tmp/pamac-build-corey/zdoom/src/zdoom/src/asm_x86_64/tmap3.s:105: Error: unknown mnemonic `addl' -- `addl $0x44444444,%r10d'
/var/tmp/pamac-build-corey/zdoom/src/zdoom/src/asm_x86_64/tmap3.s:106: Error: unknown mnemonic `movzbl' -- `movzbl 0x44444444(%rax,%rbp),%ebp'
/var/tmp/pamac-build-corey/zdoom/src/zdoom/src/asm_x86_64/tmap3.s:107: Error: unknown mnemonic `movl' -- `movl %r11d,%esi'
/var/tmp/pamac-build-corey/zdoom/src/zdoom/src/asm_x86_64/tmap3.s:108: Error: unknown mnemonic `movb' -- `movb (%r14,%rbp),%bpl'
/var/tmp/pamac-build-corey/zdoom/src/zdoom/src/asm_x86_64/tmap3.s:109: Error: unknown mnemonic `shr' -- `shr $24,%esi'
/var/tmp/pamac-build-corey/zdoom/src/zdoom/src/asm_x86_64/tmap3.s:110: Error: operand 1 must be an integer or stack pointer register -- `add $0x44444444,%r11d'
/var/tmp/pamac-build-corey/zdoom/src/zdoom/src/asm_x86_64/tmap3.s:111: Error: unknown mnemonic `movzbl' -- `movzbl 0x44444444(%rax,%rsi),%esi'
/var/tmp/pamac-build-corey/zdoom/src/zdoom/src/asm_x86_64/tmap3.s:112: Error: unknown mnemonic `movb' -- `movb %dl,(%rdi,%rcx)'
/var/tmp/pamac-build-corey/zdoom/src/zdoom/src/asm_x86_64/tmap3.s:113: Error: unknown mnemonic `movb' -- `movb %bl,1(%rdi,%rcx)'
/var/tmp/pamac-build-corey/zdoom/src/zdoom/src/asm_x86_64/tmap3.s:114: Error: unknown mnemonic `movb' -- `movb (%r15,%rsi),%sil'
/var/tmp/pamac-build-corey/zdoom/src/zdoom/src/asm_x86_64/tmap3.s:115: Error: unknown mnemonic `movb' -- `movb %bpl,2(%rdi,%rcx)'
/var/tmp/pamac-build-corey/zdoom/src/zdoom/src/asm_x86_64/tmap3.s:116: Error: unknown mnemonic `movb' -- `movb %sil,3(%rdi,%rcx)'
/var/tmp/pamac-build-corey/zdoom/src/zdoom/src/asm_x86_64/tmap3.s:118: Error: unknown mnemonic `addq' -- `addq $320,%rcx'
/var/tmp/pamac-build-corey/zdoom/src/zdoom/src/asm_x86_64/tmap3.s:119: Error: unknown mnemonic `jl' -- `jl loopit'
/var/tmp/pamac-build-corey/zdoom/src/zdoom/src/asm_x86_64/tmap3.s:121: Error: unknown mnemonic `movl' -- `movl %r8d,vplce(%rip)'
/var/tmp/pamac-build-corey/zdoom/src/zdoom/src/asm_x86_64/tmap3.s:122: Error: unknown mnemonic `movl' -- `movl %r9d,vplce+4(%rip)'
/var/tmp/pamac-build-corey/zdoom/src/zdoom/src/asm_x86_64/tmap3.s:123: Error: unknown mnemonic `movl' -- `movl %r10d,vplce+8(%rip)'
/var/tmp/pamac-build-corey/zdoom/src/zdoom/src/asm_x86_64/tmap3.s:124: Error: unknown mnemonic `movl' -- `movl %r11d,vplce+12(%rip)'
/var/tmp/pamac-build-corey/zdoom/src/zdoom/src/asm_x86_64/tmap3.s:127: Error: unknown mnemonic `addq' -- `addq $8,%rsp'
/var/tmp/pamac-build-corey/zdoom/src/zdoom/src/asm_x86_64/tmap3.s:129: Error: unknown mnemonic `pop' -- `pop %rsi'
/var/tmp/pamac-build-corey/zdoom/src/zdoom/src/asm_x86_64/tmap3.s:130: Error: unknown mnemonic `pop' -- `pop %rbp'
/var/tmp/pamac-build-corey/zdoom/src/zdoom/src/asm_x86_64/tmap3.s:131: Error: unknown mnemonic `pop' -- `pop %r12'
/var/tmp/pamac-build-corey/zdoom/src/zdoom/src/asm_x86_64/tmap3.s:132: Error: unknown mnemonic `pop' -- `pop %r13'
/var/tmp/pamac-build-corey/zdoom/src/zdoom/src/asm_x86_64/tmap3.s:133: Error: unknown mnemonic `pop' -- `pop %r14'
/var/tmp/pamac-build-corey/zdoom/src/zdoom/src/asm_x86_64/tmap3.s:134: Error: unknown mnemonic `pop' -- `pop %r15'
/var/tmp/pamac-build-corey/zdoom/src/zdoom/src/asm_x86_64/tmap3.s:135: Error: unknown mnemonic `pop' -- `pop %rdi'
/var/tmp/pamac-build-corey/zdoom/src/zdoom/src/asm_x86_64/tmap3.s:136: Error: unknown mnemonic `pop' -- `pop %rbx'
make[2]: *** [src/CMakeFiles/zdoom.dir/build.make:96: src/CMakeFiles/zdoom.dir/asm_x86_64/tmap3.o] Error 1
make[2]: *** Waiting for unfinished jobs....
make[2]: *** [src/CMakeFiles/zdoom.dir/build.make:88: src/xlat_parser.c] Segmentation fault (core dumped)
make[2]: *** Deleting file 'src/xlat_parser.c'
make[1]: *** [CMakeFiles/Makefile2:602: src/CMakeFiles/zdoom.dir/all] Error 2
make: *** [Makefile:103: all] Error 2
==> ERROR: A failure occurred in build().
    Aborting...

Vaporeon commented on 2017-03-04 04:03 (UTC)

RIP ZDoom

grubber commented on 2016-12-30 18:12 (UTC)

@mrkline, install fmodex first (doesn't matter which version), then run makepkg to build zdoom.

mrkline commented on 2016-12-30 07:28 (UTC)

With makepkg -s: ==> Starting build()... error: package 'fmodex' was not found ==> ERROR: A failure occurred in build(). Aborting... With pacaur -S zdoom: no results found for fmodex=4.44.62 I see an fmodex package in the AUR, but its current version is 4.44.58-1 and it's marked out of date. This package seems to request 4.44.62. Previously, the package was using fmodex4.26.36. What's the solution here?

grubber commented on 2016-12-29 14:45 (UTC)

@mrkline, @apollo11w, fixed.

apollo11w commented on 2016-12-28 01:28 (UTC)

-> Found launcher.desktop -> Found 0001-Improve-Mac-GCC-errors-fix-to-work-only-for-GCC.patch ==> Validating source files with sha256sums... zdoom-2.8.1-src.7z ... Passed launcher.desktop ... Passed 0001-Improve-Mac-GCC-errors-fix-to-work-only-for-GCC.patch ... FAILED ==> ERROR: One or more files did not pass the validity check! ==> ERROR: Makepkg was unable to build zdoom. ==> Restart building zdoom ? [y/N]

mrkline commented on 2016-12-16 17:15 (UTC) (edited on 2016-12-16 17:15 (UTC) by mrkline)

Could the PKGBUILD be modified to set CC and CXX to gcc and g++, respectively? The build seems to use some GCC-specific flags (such as `-Wno-unused-but-set-variable`) and spits out a bunch of warnings if the user (such as myself) has CC and CXX set to clang and clang++. Alternatively, we could patch the CMake config. This seems to be the culprit: if(NOT CMAKE_CXX_COMPILER_ID STREQUAL "GNU" OR CMAKE_CXX_COMPILER_VERSION VERSION_GREATER "4.5") set( CMAKE_C_FLAGS "${CMAKE_C_FLAGS} -Wno-unused-but-set-variable" ) Is the "NOT" in that conditional a bug?

grubber commented on 2016-05-19 17:32 (UTC)

Huh, I could swear it worked fine for me. Will fix.

kimspindel commented on 2016-05-15 15:21 (UTC)

@punkrockguy318 I got the same error but managed to fix it by installing 'fmodex4.26.36' separately first

prg commented on 2016-05-13 02:34 (UTC)

FYI - Can't build on 64bit atm :: Package(s) zdoom not found in repositories, trying AUR... :: resolving dependencies... :: no results found for fmodex=4.26.36

cronos commented on 2016-04-09 15:03 (UTC) (edited on 2016-04-09 15:06 (UTC) by cronos)

@grubber: ZDoom wanting to compile, the dependency fmodex can not find. URL not found fmodex 4.26.36 Package, the git repository is down.

grubber commented on 2016-04-08 20:43 (UTC)

@cronos: That file hasn't been part of the package for a year and a half. You are doing something wrong (hard to guess what from the information you have provided).

cronos commented on 2016-03-23 13:07 (UTC)

Unable to update ZDoom, for the same error fmodapi42636 x64.tar.gz linux ... FAILED

grubber commented on 2013-08-14 14:50 (UTC)

I think your error was caused by the changed fmod download link, as in my other zdoom packages. Fixed.

dkorzhevin commented on 2013-08-03 14:08 (UTC)

Hi, I can't build zdoom using your PKGBUILD file. ==> Making package: zdoom 2.7.1-1 (Sat Aug 3 17:03:04 EEST 2013) ==> Checking runtime dependencies... ==> Checking buildtime dependencies... ==> Retrieving sources... -> Downloading zdoom-2.7.1-src.7z... % Total % Received % Xferd Average Speed Time Time Time Current Dload Upload Total Spent Left Speed 100 2823k 100 2823k 0 0 236k 0 0:00:11 0:00:11 --:--:-- 258k -> Downloading fmodapi42636linux64.tar.gz... % Total % Received % Xferd Average Speed Time Time Time Current Dload Upload Total Spent Left Speed 100 48 0 48 0 0 69 0 --:--:-- --:--:-- --:--:-- 69 -> Found doom-share-dir.patch -> Found stack-noexec.patch -> Found zdoom.desktop ==> Validating source files with md5sums... zdoom-2.7.1-src.7z ... Passed fmodapi42636linux64.tar.gz ... FAILED doom-share-dir.patch ... Passed stack-noexec.patch ... Passed zdoom.desktop ... Passed ==> ERROR: One or more files did not pass the validity check! ==> ERROR: Makepkg was unable to build zdoom. ==> Restart building zdoom ? [y/N] ==> ------------------------------

Toney commented on 2013-03-06 07:56 (UTC)

ZDoom code license: Code original to ZDoom is under the 3-point modified BSD license. (http://zdoom.org/wiki/License)

commented on 2013-02-18 23:33 (UTC)

The symlinks probably broke because the files don't exist on my system, but I've done a few builds, without changing anything, and it's worked since. I tried tweaking the package build, and my problem with zdoom.pk3 is fixed with your solution. So, it's all good now. Thanks.

grubber commented on 2013-02-18 07:18 (UTC)

/usr/share/games/zdoom is the correct location, your config file is probably broken. There should be a "Path=/usr/share/games/zdoom/" line in the "[FileSearch.Directories]" section of your ~/.zdoom/zdoom.ini. As for the symlinks, I don't see how that could have broken your build.

commented on 2013-02-17 20:33 (UTC)

May I make a couple requests? I kept fighting an error where ZDoom "couldn't find zdoomk.pk3". I found that it needs to be in /usr/share/zdoom/zdoom.pk3, so I modified this line: install -Dm644 zdoom.pk3 "$pkgdir/usr/share/games/zdoom/zdoom.pk3" to read like this: install -Dm644 zdoom.pk3 "$pkgdir/usr/share/zdoom/zdoom.pk3" I also had to delete the symlinks for freedoom to get it to build properly, but now it works.

grubber commented on 2012-11-07 21:40 (UTC)

Updated to 2.6.1.

miffe commented on 2012-07-02 15:12 (UTC)

2.6.0 is out: http://forum.zdoom.org/viewtopic.php?f=1&p=630208#p630208

wodim commented on 2012-04-04 09:17 (UTC)

It's not possible to install this using yaourt. Please fix it.

commented on 2012-03-01 20:22 (UTC)

Error installing with yaourt: -> Extracting zdoom-2.5.0-src.7z with bsdtar zlib/ChangeLog: Lzma library error: Invalid options bsdtar: Error exit delayed from previous errors. ==> ERROR: Failed to extract zdoom-2.5.0-src.7z Aborting... ==> ERROR: Makepkg was unable to build zdoom.

dot commented on 2011-02-12 23:23 (UTC)

crash with message like Illegal operand (signal 4) on map startup (menu navigation still works) can be solved by passing -DNO_ASM=1 to cmake (you can edit PKGBUILD file for that, then makepkg again) http://forum.zdoom.org/viewtopic.php?f=4&t=10436&start=465#p537486 also, do not forget to switch output system in settings (eg to ALSA) if the sound does not work, then restart sound just left this info here. gl hf

commented on 2010-12-06 06:59 (UTC)

I am a robot. It is recommended to keep files in $pkgname/, instead of deep nesting. AUR guidelines suggest to not include binaries. Examples: zdoom/zdoom.png A survey of TUs suggests an icon or two is okay, but please ask upstream to officially include it. Suggestion: use "makepkg --source". This robot will not bother you again.

jackoneill commented on 2010-07-31 17:32 (UTC)

What is this PaxHeader folder?

grubber commented on 2010-07-29 08:41 (UTC)

Sorry. Fixed.

miffe commented on 2010-07-29 01:58 (UTC)

fmodapi42816linux.tar.gz fails the md5sum check.

grubber commented on 2010-07-27 16:06 (UTC)

Updated. Included fmodex lib in the package, as it's not API compatible between versions and updates to the fmodex package (which is now in community repo) break compilation/sound in zdoom. Also cleaned up the PKGBUILD and fixed all errors reported by namcap.