Package Details: airwave-git r155.8cd3507-3

Git Clone URL: https://aur.archlinux.org/airwave-git.git (read-only)
Package Base: airwave-git
Description: Airwave is a WINE-based VST bridge, that allows for the use of Windows 32- and 64-bit VST 2.4 audio plugins with Linux VST hosts
Upstream URL: https://github.com/phantom-code/airwave
Licenses: MIT
Conflicts: airwave
Provides: airwave
Submitter: phant0m
Maintainer: jonathon
Last Packager: jonathon
Votes: 20
Popularity: 0.148862
First Submitted: 2014-07-14 08:53
Last Updated: 2017-04-12 17:23

Latest Comments

1 2 3 Next › Last »

nhoma commented on 2019-10-18 01:35

I have a problem installing after about 28% in

6100 | union WIDL_objidl_generated_name_0000000C { | ^~~~~~~~~~~~~~~~~~~~~~~~~~~~~~~~~~~~~ /home/nika/.cache/yay/airwave-git/src/airwave/src/host/host.cpp: In member function ‘bool Airwave::Host::initialize(const char, int)’: /home/nika/.cache/yay/airwave-git/src/airwave/src/host/host.cpp:63:44: warning: cast between incompatible function types from ‘FARPROC’ {aka ‘long int (attribute((ms_abi)) )()’} to ‘Airwave::VstPluginMainProc’ {aka ‘AEffect (attribute((ms_abi)) )(long int (__attribute((ms_abi)) )(AEffect, int, int, long int, void, float))’} [-Wcast-function-type] 63 | GetProcAddress(module_, "VSTPluginMain")); | ^ /home/nika/.cache/yay/airwave-git/src/airwave/src/host/host.cpp:67:36: warning: cast between incompatible function types from ‘FARPROC’ {aka ‘long int (attribute((ms_abi)) )()’} to ‘Airwave::VstPluginMainProc’ {aka ‘AEffect (attribute((ms_abi)) )(long int (attribute((ms_abi)) )(AEffect, int, int, long int, void, float))’} [-Wcast-function-type] 67 | GetProcAddress(module_, "main")); | ^ winegcc: g++ failed make[2]: [src/host/CMakeFiles/airwave-host-64.dir/build.make:128: src/host/CMakeFiles/airwave-host-64.dir/host.cpp.o] Error 2 make[1]: [CMakeFiles/Makefile2:148: src/host/CMakeFiles/airwave-host-64.dir/all] Error 2 make: ** [Makefile:130: all] Error 2 ==> ERROR: A failure occurred in build(). Aborting... Error making: airwave-git

alvafox commented on 2019-01-06 20:54

@mlaqts yes, I have glibc.

In fact, I solved the build problem. If someone wants to know how. When I received another error that pointed to a library containing "include_next", I changed "include_next" to "include" in it, it helped, but this is a very ugly solution imo.

mlaqts commented on 2019-01-06 01:06

@alvafox Do you have glibc installed?

$ pacman -Qo /usr/include/stdlib.h
/usr/include/stdlib.h is owned by glibc 2.28-5

alvafox commented on 2018-11-27 08:28

Hi, I have a error when trying to build this:

/usr/include/c++/8.2.1/cstdlib:75:15: fatal error: stdlib.h: No such file or directory

include_next <stdlib.h>

^~~~~~~~~~

Does anyone know how to resolve this? On the web I'm finding information about this issue: https://gcc.gnu.org/bugzilla/show_bug.cgi?id=70129

Maybe some hacks on the source code or adding Cmake flags might help?

jcelerier commented on 2018-11-21 09:19

Hi, when I build this package I don't get the toolbar in airwave-manager... (it was there on older versions) anyone knows how can I fix this ? thanks !

parataxis0 commented on 2017-12-12 15:50

I made instructions for those of you having issues with the wine layer not rendering the window entirely, or even resizing issues I have heard about. Might or might not resolve graphical issues entirely if you run into them.

https://pastebin.com/raw/yPczhBEE

Good day!

jonathon commented on 2017-04-12 17:24

Updated. :)

milk commented on 2017-04-12 16:01

Build is failing atm, bug is resolved, removing the patch fixes. Error is;

...
==> Extracting sources...
-> Creating working copy of airwave git repo...
Cloning into 'airwave'...
done.
Switched to a new branch 'makepkg'
==> Starting prepare()...
patching file airwave/src/host/winnt.h
Hunk #1 FAILED at 5438.
1 out of 1 hunk FAILED -- saving rejects to file airwave/src/host/winnt.h.rej
==> ERROR: A failure occurred in prepare().
Aborting...
...

jhernberg commented on 2017-02-24 13:32

Yes, builds for me too. Many thanks!

jonathon commented on 2017-02-24 12:20

PKGBUILD updated with upstream's patch; package is building again for me.