Package Details: avogadrolibs-git 1.93.0.r1846.cdfdf9bd-1

Git Clone URL: (read-only, click to copy)
Package Base: avogadrolibs-git
Description: Avogadro 2: libraries
Upstream URL:
Licenses: Kitware
Conflicts: avogadrolibs
Provides: avogadrolibs
Submitter: berquist
Maintainer: berquist
Last Packager: berquist
Votes: 2
Popularity: 0.000014
First Submitted: 2015-07-24 13:28
Last Updated: 2020-03-21 21:59

Latest Comments

a.kudelin commented on 2019-05-15 14:28

@berquist Done already, they didn't respond. I just suggested a workaround to disable such instructions as AVX/AVX2 to prevent crashes.

berquist commented on 2019-05-15 03:00

unset CFLAGS and CXXFLAGS which cause the Eigen3 crash when specific vector instructions are enabled by them.

I don't see how this is relevant. Please provide an example of how this happens, or better yet file an issue upstream:

a.kudelin commented on 2019-05-06 11:07

Please, add python-cclib to dependencies and unset CFLAGS and CXXFLAGS which cause the Eigen3 crash when specific vector instructions are enabled by them.

berquist commented on 2018-09-07 03:05

I've disabled MMTF, so this should be fixed now.

unkcpz commented on 2018-08-31 05:02

I got following error while makepkg --nocheck:

-- Determined Source Version : 1.91.0-25-g207b959f CMake Error at /usr/share/cmake-3.12/Modules/FindPackageHandleStandardArgs.cmake:137 (message): Could NOT find MMTF (missing: MMTF_INCLUDE_DIR) Call Stack (most recent call first): /usr/share/cmake-3.12/Modules/FindPackageHandleStandardArgs.cmake:378 (_FPHSA_FAILURE_MESSAGE) cmake/FindMMTF.cmake:13 (find_package_handle_standard_args) avogadro/io/CMakeLists.txt:4 (find_package)

-- Configuring incomplete, errors occurred! See also "/tmp/avogadrolibs-git/src/avogadrolibs/CMakeFiles/CMakeOutput.log". ==> ERROR: A failure occurred in build(). Aborting...

Tharbad commented on 2018-08-04 23:35

Getting: !! No providers for libmsym found.

berquist commented on 2018-04-06 18:38

You should run makepkg with --nocheck.

silent commented on 2018-04-01 11:10

The following tests FAILED: 21 - QtGui-GenericHighlighter (SEGFAULT) 23 - QtGui-Molecule (Failed) 25 - QtGui-RWMolecule (Failed) Errors while running CTest make: *** [Makefile:73: test] Error 8

berquist commented on 2016-04-21 21:25

I'm hesitant to do that because of how Git packages work. If I have this package require `molequeue-git`, then you couldn't use it with a stable release. One could argue that you shouldn't mix Git and stable versions, but because of this plus not building these with an AUR helper (I handle big packages manually), I'd rather just have it require `molequeue` even though it doesn't exist.

If you're having problems building these packages when *not* using an AUR helper, let me know, because that isn't good.

qguv commented on 2016-04-19 20:08

I'm getting:

$ pacaur -Sa avogadrolibs-git
:: resolving dependencies...
:: no results found for molequeue

I see molequeue-git in the AUR; perhaps you could update the dependency for that?