Search Criteria
Package Details: balena-etcher 2:2.1.0-1
Package Actions
Git Clone URL: | https://aur.archlinux.org/balena-etcher.git (read-only, click to copy) |
---|---|
Package Base: | balena-etcher |
Description: | Flash OS images to SD cards & USB drives, safely and easily |
Upstream URL: | https://balena.io/etcher |
Licenses: | Apache-2.0 |
Conflicts: | etcher, etcher-bin, etcher-git |
Submitter: | gin078 |
Maintainer: | zhullyb (Clansty, sukanka, lilac) |
Last Packager: | sukanka |
Votes: | 263 |
Popularity: | 0.73 |
First Submitted: | 2019-05-13 11:35 (UTC) |
Last Updated: | 2025-03-01 03:02 (UTC) |
Dependencies (9)
- electron34 (electron34-binAUR)
- nodejs-lts-jod
- git (git-gitAUR, git-glAUR) (make)
- jq (jq-gitAUR, jaq-binAUR) (make)
- moreutils (moreutils-go-binAUR) (make)
- npm (corepackerAUR, python-nodejs-wheelAUR) (make)
- python (python37AUR, python311AUR, python310AUR) (make)
- python-setuptools (make)
- libnotify (libnotify-gitAUR) (optional) – for notifications
Latest Comments
« First ‹ Previous 1 .. 17 18 19 20 21 22 23 24 25 26 27 .. 30 Next › Last »
haavard commented on 2018-11-03 14:21 (UTC)
ector: seems like you're having network issues. Check out the comment to vosskaem below and make sure your network is working (can you clone the repository in the error manually?).
ector commented on 2018-11-03 13:53 (UTC)
Unhandled rejection Error: Command failed: /usr/bin/git clone --depth=1 -q -b core-streams git://github.com/resin-io-modules/unbzip2-stream.git /home/giosue/.cache/yay/etcher/src/etcher/dist/.tmp/npm/npm-cache/_cacache/tmp/git-clone-70195241 warning: templates not found in /tmp/pacote-git-template-tmp/git-clone-e31e9b28 fatal: unable to look up github.com (port 9418) (Temporary failure in name resolution)
npm ERR! cb() never called!
npm ERR! This is an error with npm itself. Please report this error at: npm ERR! <https://npm.community>
npm ERR! A complete log of this run can be found in: npm ERR! /home/giosue/.cache/yay/etcher/src/etcher/dist/.tmp/npm/npm-cache/_logs/2018-11-03T13_52_39_685Z-debug.log make: *** [Makefile:97: electron-develop] Error 1 ==> ERROR: A failure occurred in build(). Aborting... Error making: etcher [giosue@giosue-pc ~]$
ector commented on 2018-11-03 13:50 (UTC)
how this error,and not install etcher npm WARN read-shrinkwrap This version of npm is compatible with lockfileVersion@1, but npm-shrinkwrap.json was generated for lockfileVersion@0. I'll try to do my best with it
haavard commented on 2018-11-01 19:55 (UTC) (edited on 2018-11-01 19:56 (UTC) by haavard)
Zeioth, this seems to be due to upstream's horrible build system -- I'll look into patching/submitting some issues upstream. For now, to work around that error, you can make the 'aws' command unavailable by temporarily uninstalling the package that provides it, or by building in a chroot.
Zeioth commented on 2018-11-01 19:06 (UTC)
Fails to install with the next error: https://i.imgur.com/pQKLVyI.png
haavard commented on 2018-11-01 06:39 (UTC)
jq is listed in makedepends. Are you experiencing any errors?
prurigro commented on 2018-11-01 03:26 (UTC)
The build dependency jq is missing for the latest version
haavard commented on 2018-10-28 10:50 (UTC) (edited on 2018-10-28 10:51 (UTC) by haavard)
vosskaem, I suggest you take a look at some of the Stack Overflow questions linked below. This is unlikely to be a packaging issue, but an issue with your proxy/network situation.
https://stackoverflow.com/questions/4891527/git-protocol-blocked-by-company-how-can-i-get-around-that https://stackoverflow.com/questions/31113433/accessing-github-behind-corporate-proxy-node-js
vosskaem commented on 2018-10-27 14:17 (UTC)
Unable to build behind proxy: npm ERR! Error while executing: npm ERR! /usr/bin/git ls-remote -h -t git://github.com/jviotti/webpack.git npm ERR! npm ERR! fatal: unable to connect to :github.com:
SpectralMemories commented on 2018-09-15 01:02 (UTC)
FFY00 That would be awesome of you, for real
« First ‹ Previous 1 .. 17 18 19 20 21 22 23 24 25 26 27 .. 30 Next › Last »