Package Details: fife-git 0.4.1.r372.g85626ccd-1

Git Clone URL: (read-only)
Package Base: fife-git
Description: The mission of the FIFE project is to create a cross platform game creation framework
Upstream URL:
Licenses: LGPL
Conflicts: fife, fife-svn
Provides: fife, fife-svn
Submitter: ChrisOelmueller
Maintainer: ChrisOelmueller
Last Packager: LinuxDonald
Votes: 8
Popularity: 0.091869
First Submitted: 2015-08-14 07:48
Last Updated: 2018-05-13 15:48

Latest Comments

1 2 3 Next › Last »

LinuxDonald commented on 2018-05-13 15:49

Package is updated

LinuxDonald commented on 2018-05-13 15:49

Sorry guys for the delay. i Must setup an arch linux vm. I dont have Arch Linux for an long time anymore.

LinuxDonald commented on 2018-03-25 15:08

Yeah sorry for this an: -Dcegui=OFF helps.


I will update the AUR package next weekend

RemoteAdmin commented on 2018-02-16 05:03

CEGUI was added upstream and now fails the build.

-- Could not locate CEGUI
CMake Error at cmake/FindCEGUI.cmake:247 (message):
  Required library CEGUI not found! Install the library (including dev
  packages) and try again.  If the library is already installed, set the
  missing variables manually in cmake.
Call Stack (most recent call first):
  cmake/FindCEGUI.cmake:490 (findpkg_finish)
  CMakeLists.txt:769 (find_package)

LinuxDonald commented on 2017-02-25 12:27

Updated fife-git pkgbuild file:

LinuxDonald commented on 2017-02-23 14:04

@ChrisOelmueller Version update would be nice too 0.4.1git

LinuxDonald commented on 2017-02-23 14:03

fife-git version now have an new dep: glew

dixi_minga commented on 2016-10-03 21:13

Thanks a lot Chris, works

ChrisOelmueller commented on 2016-10-03 19:44

Unfortunately there's no clean way of requiring certain git package upgrades. In your case, it seems likely you'd have to rebuild (and re-install) `fifechan-git` to obtain its latest version, then try to trigger the `fife-git` rebuild again.

dixi_minga commented on 2016-10-03 19:21

I get this error - any idea? thx

[ 98%] Building CXX object CMakeFiles/_fifechan.dir/fifechanPYTHON_wrap.cxx.o
/src/fifengine/build/fifechanPYTHON_wrap.cxx: In function 'PyObject* _wrap_Widget_isModalFocusable(PyObject*, PyObject*)':
/src/fifengine/build/fifechanPYTHON_wrap.cxx:7601:47: error: 'const class fcn::Widget' has no member named 'isModalFocusable'; did you mean 'isModalFocused'?
result = (bool)((fcn::Widget const *)arg1)->isModalFocusable();
/src/fifengine/build/fifechanPYTHON_wrap.cxx: In function 'PyObject* _wrap_Widget_isModalMouseInputFocusable(PyObject*, PyObject*)':
/src/fifengine/build/fifechanPYTHON_wrap.cxx:7623:47: error: 'const class fcn::Widget' has no member named 'isModalMouseInputFocusable'; did you mean 'isModalMouseInputFocused'?
result = (bool)((fcn::Widget const *)arg1)->isModalMouseInputFocusable();
make[2]: *** [CMakeFiles/_fifechan.dir/build.make:71: CMakeFiles/_fifechan.dir/fifechanPYTHON_wrap.cxx.o] Error 1
make[1]: *** [CMakeFiles/Makefile2:105: CMakeFiles/_fifechan.dir/all] Error 2
make: *** [Makefile:128: all] Error 2
==> ERROR: A failure occurred in build().