Package Details: fsearch-git 0.1.r71.ge874642-1

Git Clone URL: https://aur.archlinux.org/fsearch-git.git (read-only, click to copy)
Package Base: fsearch-git
Description: A fast graphical file search utility. Development version.
Upstream URL: https://cboxdoerfer.github.io/fsearch
Keywords: search
Licenses: GPL2
Conflicts: fsearch
Submitter: wander
Maintainer: wander
Last Packager: wander
Votes: 56
Popularity: 2.39
First Submitted: 2016-05-31 16:28
Last Updated: 2022-01-14 18:31

Latest Comments

« First ‹ Previous 1 2 3 4 Next › Last »

salvaju29ro commented on 2021-09-27 05:58

It seems that the first stable version has been released:

https://github.com/cboxdoerfer/fsearch/releases/tag/v0.1

wander commented on 2021-04-21 19:17

@CorvetteCole, done :)

CorvetteCole commented on 2021-04-21 19:13

hello @wander do you mind removing the out of date flag, BORBER accidentally set it

MarsSeed commented on 2021-03-31 10:47

@BORBER you can remove the out-of-date flag yourself.

BORBER commented on 2021-03-29 09:41

Sorry, I opened two aur forms at the same time and marked the package incorrectly

wander commented on 2020-03-08 15:04

@yochananmarqos: Oh, thank you! Fixed.

yochananmarqos commented on 2020-03-08 14:51

@supermuffin: You updated the pkgver() function, but you didn't actually run at least makepkg -od to generate the pkgver before you pushed your commit. ;)

supermuffin commented on 2020-03-07 20:25

@wander: Thank you!

wander commented on 2020-03-07 19:01

@supermuffin: Thanks, fixed.

supermuffin commented on 2020-03-07 18:30

new pkgver=r493.03b2996 does not build:

make[2]: Entering directory '/var/tmp/pamac-build-sumu/fsearch-git/src/fsearch/po'
*** error: gettext infrastructure mismatch: using a Makefile.in.in from gettext version 0.19 but the autoconf macros are from gettext version 0.20
make[2]: *** [Makefile:227: stamp-po] Error 1
make[2]: Leaving directory '/var/tmp/pamac-build-sumu/fsearch-git/src/fsearch/po'
make[1]: *** [Makefile:395: all-recursive] Error 1
make[1]: Leaving directory '/var/tmp/pamac-build-sumu/fsearch-git/src/fsearch'
make: *** [Makefile:336: all] Error 2
==> ERROR: A failure occurred in build().
    Aborting...