Package Details: glib2-docs-git

Git Clone URL: (read-only, click to copy)
Package Base: glib2-git
Description: Low Level Core Library
Upstream URL:
Licenses: custom, LGPL2.1
Conflicts: glib2-docs
Provides: glib2-docs
Submitter: kfgz
Maintainer: SolarAquarion
Last Packager: SolarAquarion
Votes: 47
Popularity: 0.091890
First Submitted: 2010-09-20 13:24 (UTC)
Last Updated: 2021-02-08 13:45 (UTC)

Required by (16)

Sources (4)

Latest Comments

A.J commented on 2022-01-19 08:56 (UTC)

i get an error :

FAILED: glib/ 
cc -Iglib/ -Iglib -I../glib/glib -I. -I../glib -flto=auto -fdiagnostics-color=always -D_FILE_OFFSET_BITS=64 -Wall -Winvalid-pch -Wextra -Wpedantic -std=gnu99 -D_GNU_SOURCE -fno-strict-aliasing -DG_ENABLE_DEBUG -Wduplicated-branches -Wimplicit-fallthrough -Wmisleading-indentation -Wunused -Wno-unused-parameter -Wno-cast-function-type -Wno-pedantic -Wno-format-zero-length -Wno-variadic-macros -Werror=format=2 -Werror=init-self -Werror=missing-include-dirs -Werror=pointer-arith -Wstrict-prototypes -Wno-bad-function-cast -Werror=declaration-after-statement -Werror=implicit-function-declaration -Werror=missing-prototypes -march=x86-64 -mtune=generic -O2 -pipe -fno-plt -fexceptions -Wp,-D_FORTIFY_SOURCE=2 -Wformat -Werror=format-security -fstack-clash-protection -fcf-protection -DG_DISABLE_CAST_CHECKS -fPIC -pthread '-DG_LOG_DOMAIN="GLib"' -DGLIB_COMPILATION -fvisibility=hidden -MD -MQ glib/ -MF glib/ -o glib/ -c ../glib/glib/ggettext.c
../glib/glib/ggettext.c: In function ‘g_dcgettext’:
../glib/glib/ggettext.c:429:10: error: implicit declaration of function ‘dcgettext’ [-Werror=implicit-function-declaration]
  429 |   return dcgettext (domain, msgid, category);
      |          ^~~~~~~~~
../glib/glib/ggettext.c:429:10: warning: incompatible implicit declaration of built-in function ‘dcgettext’ [-Wbuiltin-declaration-mismatch]
cc1: some warnings being treated as errors

tallero commented on 2021-02-08 06:37 (UTC)

Agreed on @ignapk. Updated PKGBUILD

ignapk commented on 2021-02-05 02:36 (UTC)

Please add


in the package_glib2() function so it's possible to replace glib2 with this package.

shoober420 commented on 2020-10-06 18:57 (UTC)

Can you please add “ CFLAGS+=" -DG_DISABLE_CAST_CHECKS" to the “build()” section of the PKGBUILD to reflect the official repo options?

Salamandar commented on 2018-06-27 14:49 (UTC)

This package could be built with Meson now.

There was a typo for _pkgname.

The paths (srcdir/pkgdir) were not always specified.

I fixed all that here:

SolarAquarion commented on 2018-04-18 12:18 (UTC)


Salamandar commented on 2016-02-17 18:23 (UTC)

Thanks mnovick. I'll flag the package out-of-date.

EndlessEden commented on 2015-12-12 08:57 (UTC)

please update pkgbuild | prepare() { cd $pkgname/ touch gtk-doc.make sed -i '1i\EXTRA_DIST=""\nCLEANFILES=""\n' docs/reference/{gio,gobject,glib}/ }

haawda commented on 2015-09-12 14:57 (UTC)

Please arevert-warn-glib-compile-schemas.patch from the package in [core]. This avoids lots of useless warnings when installing packages that depend on glib2-git.

luolimao commented on 2013-11-01 04:04 (UTC)

Or you could just rebuild...? (I get version automatically when I run makepkg)

ivdok commented on 2013-10-31 02:28 (UTC)

Please bump version number:

luolimao commented on 2013-06-05 20:21 (UTC)


lubosz commented on 2013-06-04 15:27 (UTC)

disable-docs.patch does not apply anymore

luolimao commented on 2013-04-13 00:39 (UTC)

Updated to work with pacman 4.1

commented on 2012-12-14 02:33 (UTC)

Please chenge _gitroot=git:// to _gitroot=git://

kfgz commented on 2011-06-20 16:42 (UTC)

@jazznaz, it's the git version. It should be buggy ;)

kfgz commented on 2011-06-20 16:40 (UTC)

It should be fixed now. Please test and report.

commented on 2011-06-20 15:44 (UTC)

Completely breaks Gnome 3 on my system with the error: " warning: undefined reference to <schema id=''/> " Problem only fixed by reverting back to glib2.

commented on 2011-06-20 14:23 (UTC)

Fails to build for me (x64): Making all in tests make[4]: Entering directory `/tmp/yaourt-tmp-votan/aur-glib2-git/src/glib-build/gio/tests' GEN gdbus-test-codegen-generated.c /bin/sh: /usr/bin/python22: No such file or directory make[4]: *** [gdbus-test-codegen-generated.c] Error 127 make[4]: Leaving directory `/tmp/yaourt-tmp-votan/aur-glib2-git/src/glib-build/gio/tests' make[3]: *** [all-recursive] Error 1 make[3]: Leaving directory `/tmp/yaourt-tmp-votan/aur-glib2-git/src/glib-build/gio' make[2]: *** [all] Error 2 make[2]: Leaving directory `/tmp/yaourt-tmp-votan/aur-glib2-git/src/glib-build/gio' make[1]: *** [all-recursive] Error 1 make[1]: Leaving directory `/tmp/yaourt-tmp-votan/aur-glib2-git/src/glib-build' make: *** [all] Error 2

Marcel_K commented on 2011-05-06 15:30 (UTC)

Package is built correctly here (i686)

kfgz commented on 2011-05-06 15:21 (UTC)

Fixed. Please test and report.

kfgz commented on 2011-05-06 15:02 (UTC)

Be patient. Fix is on the way ;]

bob_art commented on 2011-05-06 10:40 (UTC)

"I get an error about gdbus-example-objectmanager-generated.h" Similarly... File "../gio/gdbus-codegen/", line 199, in <module> codegen_main() File "../gio/gdbus-codegen/", line 150, in codegen_main arg_parser.add_argument('xml_files', metavar='FILE', type=file, nargs='+', NameError: global name 'file' is not defined ...

kfgz commented on 2011-03-31 09:26 (UTC)

Done. Thx.

ultimA commented on 2011-03-31 02:59 (UTC)

Hi, consider adding 'git' to makedepends.

kfgz commented on 2011-03-17 20:31 (UTC)

Fixed. Thx.