Package Details: kcoreaddons-git r229.d5802ea-2

Git Clone URL: https://aur.archlinux.org/kcoreaddons-git.git (read-only)
Package Base: kcoreaddons-git
Description: KCoreAddons
Upstream URL: https://projects.kde.org/projects/frameworks/kcoreaddons
Licenses: LGPL
Groups: kf5
Conflicts: kcoreaddons
Provides: kcoreaddons
Submitter: ilpianista
Maintainer: None
Last Packager: Alad
Votes: 29
Popularity: 0.003517
First Submitted: 2014-01-04 11:37
Last Updated: 2016-06-24 01:42

Required by (23)

Sources (1)

Latest Comments

desaparecido commented on 2014-04-28 09:10

@arojas thanks, effectivly I have [testing] repo enable so GCC 4.9 and bug report is done:

https://bugs.kde.org/show_bug.cgi?id=333998

arojas commented on 2014-04-28 08:45

@desaparecido Is this with GCC 4.9? If so, please report it to bugs.kde.org, it build correctly with GCC 4.8

desaparecido commented on 2014-04-28 08:22

hi, i have this error when build.. I tried at differents moments the last days to try with differents commits and is the same, here the message:

/home/luis/builds/kf5-git/kcoreaddons-git/src/kcoreaddons/src/lib/util/kuser_unix.cpp:395:54: error: ‘std::function’ has not been declared
void listGroupMembers(gid_t gid, uint maxCount, std::function<void(passwd*)> handleNextGroupUser)
^
/home/luis/builds/kf5-git/kcoreaddons-git/src/kcoreaddons/src/lib/util/kuser_unix.cpp:395:62: error: expected ‘,’ or ‘...’ before ‘<’ token
void listGroupMembers(gid_t gid, uint maxCount, std::function<void(passwd*)> handleNextGroupUser)
^
/home/luis/builds/kf5-git/kcoreaddons-git/src/kcoreaddons/src/lib/util/kuser_unix.cpp: In function ‘void listGroupMembers(gid_t, uint, int)’:
/home/luis/builds/kf5-git/kcoreaddons-git/src/kcoreaddons/src/lib/util/kuser_unix.cpp:410:34: error: ‘handleNextGroupUser’ was not declared in this scope
handleNextGroupUser(p);
^
/home/luis/builds/kf5-git/kcoreaddons-git/src/kcoreaddons/src/lib/util/kuser_unix.cpp:426:34: error: ‘handleNextGroupUser’ was not declared in this scope
handleNextGroupUser(p);
^
/home/luis/builds/kf5-git/kcoreaddons-git/src/kcoreaddons/src/lib/util/kuser_unix.cpp: In member function ‘QList<KUser> KUserGroup::users(uint) const’:
/home/luis/builds/kf5-git/kcoreaddons-git/src/kcoreaddons/src/lib/util/kuser_unix.cpp:438:6: error: cannot convert ‘KUserGroup::users(uint) const::<lambda(const passwd*)>’ to ‘int’ for argument ‘3’ to ‘void listGroupMembers(gid_t, uint, int)’
});
^
/home/luis/builds/kf5-git/kcoreaddons-git/src/kcoreaddons/src/lib/util/kuser_unix.cpp: In member function ‘QStringList KUserGroup::userNames(uint) const’:
/home/luis/builds/kf5-git/kcoreaddons-git/src/kcoreaddons/src/lib/util/kuser_unix.cpp:447:6: error: cannot convert ‘KUserGroup::userNames(uint) const::<lambda(const passwd*)>’ to ‘int’ for argument ‘3’ to ‘void listGroupMembers(gid_t, uint, int)’
});
^
src/lib/CMakeFiles/KF5CoreAddons.dir/build.make:609: recipe for target 'src/lib/CMakeFiles/KF5CoreAddons.dir/util/kuser_unix.cpp.o' failed
make[2]: *** [src/lib/CMakeFiles/KF5CoreAddons.dir/util/kuser_unix.cpp.o] Error 1
make[2]: *** Waiting for unfinished jobs....
CMakeFiles/Makefile2:97: recipe for target 'src/lib/CMakeFiles/KF5CoreAddons.dir/all' failed
make[1]: *** [src/lib/CMakeFiles/KF5CoreAddons.dir/all] Error 2
Makefile:116: recipe for target 'all' failed
make: *** [all] Error 2
==> ERROR: A failure occurred in build().
Aborting.