Package Details: linux-ck 6.9.6-1

Git Clone URL: https://aur.archlinux.org/linux-ck.git (read-only, click to copy)
Package Base: linux-ck
Description: The Linux kernel and modules with ck's hrtimer patches
Upstream URL: https://wiki.archlinux.org/index.php/Linux-ck
Licenses: GPL-2.0-only
Provides: KSMBD-MODULE, VIRTUALBOX-GUEST-MODULES, WIREGUARD-MODULE
Replaces: virtualbox-guest-modules-arch, wireguard-arch
Submitter: graysky
Maintainer: graysky
Last Packager: graysky
Votes: 459
Popularity: 0.28
First Submitted: 2011-07-22 14:51 (UTC)
Last Updated: 2024-06-21 18:26 (UTC)

Latest Comments

« First ‹ Previous 1 2 3 4 5 6 7 8 .. 307 Next › Last »

j_marinaro commented on 2023-11-30 06:00 (UTC) (edited on 2023-11-30 06:44 (UTC) by j_marinaro)

Hi graysky, I get a build error on the kernel and the headers. I did a clean chroot build. This is what I get, form both the kernel and headers. The errors are exactly the same: Hunk #1 FAILED at 324. 1 out of 1 hunk FAILED -- saving rejects to file fs/btrfs/delalloc-space.c.rej patching file sound/usb/line6/pcm.c

queenbiscuit311 commented on 2023-11-01 09:28 (UTC)

Can confirm that 6.6-2 compiles as expected!

graysky commented on 2023-10-31 11:19 (UTC)

Try 6.6-2

graysky commented on 2023-10-31 10:40 (UTC)

Yes, this affects the official package as well: https://bugs.archlinux.org/task/80115

d0rfm4tr4tz3 commented on 2023-10-31 08:58 (UTC) (edited on 2023-10-31 08:58 (UTC) by d0rfm4tr4tz3)

Before the message queenbiscuit311 quoted appears, there is another one before:

Warning: 'make modules_install' requires /doesnt/exist. Please install it. This is probably in the kmod package.

queenbiscuit311 commented on 2023-10-31 02:25 (UTC) (edited on 2023-10-31 04:20 (UTC) by queenbiscuit311)

Building seems to go basically to completion, before getting stuck at

rm: cannot remove '/home/[user]/.cache/yay/linux-ck/pkg/linux-ck/usr/lib/modules/6.6.0-1-ck/source': No such file or directory

and failing during packaging.This also fails directly via makepkg.

graysky commented on 2023-05-02 09:28 (UTC)

https://bbs.archlinux.org/viewtopic.php?id=285413

simona commented on 2023-05-02 09:12 (UTC)

==> dkms install --no-depmod vboxhost/7.0.8_OSE -k 6.3.1-1-ck-generic-v3
Error! Bad return status for module build on kernel: 6.3.1-1-ck-generic-v3 (x86_64)
Consult /var/lib/dkms/vboxhost/7.0.8_OSE/build/make.log for more information.

zerophase commented on 2023-05-02 05:21 (UTC)

Anyone else getting errors when trying to build 6.3.1-1?

btf_encoder__encode: btf__dedup failed!
Failed to encode BTF
  LD      .tmp_vmlinux.kallsyms1
  NM      .tmp_vmlinux.kallsyms1.syms
  KSYMS   .tmp_vmlinux.kallsyms1.S
  AS      .tmp_vmlinux.kallsyms1.S
  LD      .tmp_vmlinux.kallsyms2
  NM      .tmp_vmlinux.kallsyms2.syms
  KSYMS   .tmp_vmlinux.kallsyms2.S
  AS      .tmp_vmlinux.kallsyms2.S
  LD      vmlinux
  BTFIDS  vmlinux
libbpf: failed to find '.BTF' ELF section in vmlinux
FAILED: load BTF from vmlinux: No data available
make[1]: *** [scripts/Makefile.vmlinux:35: vmlinux] Error 255
make[1]: *** Deleting file 'vmlinux'
make: *** [Makefile:1249: vmlinux] Error 2

Fails on both clang and gcc.