Package Details: pfstools 2.1.0-2

Git Clone URL: https://aur.archlinux.org/pfstools.git (read-only)
Package Base: pfstools
Description: Set of command line programs for reading, writing and manipulating high-dynamic range (HDR) images
Upstream URL: http://pfstools.sourceforge.net/
Licenses: LGPL2.1
Conflicts: pfscalibration, pfstmo
Provides: pfscalibration, pfstmo
Submitter: None
Maintainer: stativ
Last Packager: stativ
Votes: 37
Popularity: 0.000331
First Submitted: 2006-11-15 06:01
Last Updated: 2018-11-10 15:00

Dependencies (24)

Required by (0)

Sources (3)

Latest Comments

« First ‹ Previous 1 2 3

floft commented on 2014-06-30 21:32

Where did that zero come from after -O3? I suspect there's something up with your CXXFLAGS in /etc/makepkg.conf.

dreieck commented on 2014-06-30 21:26

I get error:

==>
make all-recursive
make[1]: Entering directory '/var/tmp/yaourt-tmp-root/aur-pfstools/src/pfstools-1.8.5'
Making all in src
make[2]: Entering directory '/var/tmp/yaourt-tmp-root/aur-pfstools/src/pfstools-1.8.5/src'
Making all in pfs
make[3]: Entering directory '/var/tmp/yaourt-tmp-root/aur-pfstools/src/pfstools-1.8.5/src/pfs'
g++ -DHAVE_CONFIG_H -I. -I../.. -fPIC -O3 0 -march=x86-64 -mtune=generic -pipe -fstack-protector --param=ssp-buffer-size=4 -D_FORTIFY_SOURCE=2 -fomit-frame-pointer -fpermissive -MT libpfs_a-pfs.o -MD -MP -MF .deps/libpfs_a-pfs.Tpo -c -o libpfs_a-pfs.o `test -f 'pfs.cpp' || echo './'`pfs.cpp
g++: error: 0: No such file or directory
Makefile:376: recipe for target 'libpfs_a-pfs.o' failed
make[3]: *** [libpfs_a-pfs.o] Error 1
make[3]: Leaving directory '/var/tmp/yaourt-tmp-root/aur-pfstools/src/pfstools-1.8.5/src/pfs'
Makefile:290: recipe for target 'all-recursive' failed
make[2]: *** [all-recursive] Error 1
make[2]: Leaving directory '/var/tmp/yaourt-tmp-root/aur-pfstools/src/pfstools-1.8.5/src'
Makefile:326: recipe for target 'all-recursive' failed
make[1]: *** [all-recursive] Error 1
make[1]: Leaving directory '/var/tmp/yaourt-tmp-root/aur-pfstools/src/pfstools-1.8.5'
Makefile:255: recipe for target 'all' failed
make: *** [all] Error 2
<==

stativ commented on 2014-04-02 09:15

deepsoul: fixed.

deepsoul commented on 2014-03-28 17:09

I get link errors when building (target pfsinexr):

libtool: link: g++ -O3 .....
/usr/lib/gcc/x86_64-unknown-linux-gnu/4.8.2/../../../../lib/libIlmThread.so: undefined reference to `sem_init'

and 7 more such lines with other sem_... symbols and pthread_join. When I compile without the PKGBUILD with the same configure options, it builds without error, suggesting this is not an upstream issue. I do not understand this at all.

bartus commented on 2013-03-12 13:56

pfstool is missing build-dep: automoc4.
Also configure invocation, moc path is obsolete (should be /usr/bin/moc-qt4)

Anonymous comment on 2012-06-22 15:12

pfshdrcalibrate is broken in 1.8.5; it will only return a blank PFS stream.

Anonymous comment on 2012-05-26 07:27

Here is a slightly modified PKGBUILD for 1.8.5.
http://pastebin.com/raw.php?i=fv8a9pVg

Anonymous comment on 2012-05-26 07:24

Looks like version 1.8.5 is out there. Please update.

http://sourceforge.net/projects/pfstools/files/pfstools/1.8.5/

orbisvicis commented on 2011-05-30 20:30

I took the liberty of uploading a new modified PKGBUILD:
http://hpaste.org/47277/pkgbuildpfstools

orbisvicis commented on 2011-05-30 16:10

no news but @ http://sourceforge.net/projects/pfstools/files/pfstools/1.8.4/