Package Details: sxemacs-git 22.1.16.17.g8f64b93-1

Git Clone URL: https://aur.archlinux.org/sxemacs-git.git (read-only)
Package Base: sxemacs-git
Description: A derivation of xemacs - git checkout
Upstream URL: http://www.sxemacs.org/
Keywords: editor
Licenses: GPL
Conflicts: sxemacs, xemacs
Provides: sxemacs
Submitter: haawda
Maintainer: haawda
Last Packager: haawda
Votes: 2
Popularity: 0.006974
First Submitted: 2012-03-23 22:11
Last Updated: 2016-06-18 13:54

Latest Comments

SolarAquarion commented on 2015-12-11 02:05

@haawda for some reason clang removes the problem

haawda commented on 2015-12-10 21:29

SolarAquarion, I had the same problem and opened a bug report for it. See http://issues.sxemacs.org/show_bug.cgi?id=172

But now I cannot reproduce the problem anymore. Please try again.

SolarAquarion commented on 2015-12-08 18:54

_SOURCE=2 -I/usr/local/include -I/usr/include -D_FORTIFY_SOURCE=2 -I/usr/local/include -DINHIBIT_STRING_HEADER -march=x86-64 -mtune=generic -O2 -pipe -fstack-protector-strong -MT movemail-regex.o -MD -MP -MF .deps/movemail-regex.Tpo -c -o movemail-regex.o `test -f '../../sxemacs/src/regex.c' || echo '../../sxemacs/lib-src/'`../../sxemacs/src/regex.c
In file included from ../../sxemacs/src/regex.c:86:0:
../../sxemacs/src/sxe-utils.h:204:6: error: expected specifier-qualifier-list before ‘(’ token
(so just call ALIGNOF with a typedef'ed name)
^
../../sxemacs/src/sxe-utils.h:204:42: warning: missing terminating ' character
(so just call ALIGNOF with a typedef'ed name)
^
../../sxemacs/src/sxe-utils.h:204:6: error: missing terminating ' character
(so just call ALIGNOF with a typedef'ed name)
^
../../sxemacs/src/sxe-utils.h:205:14: warning: missing terminating ' character
- it doesn't work with C++. The C++ committee has decided,
^
../../sxemacs/src/sxe-utils.h:205:4: error: missing terminating ' character
- it doesn't work with C++. The C++ committee has decided,
^
../../sxemacs/src/sxe-utils.h:218:2: error: #endif without #if
#endif /* ALIGNOF */
^
../../sxemacs/src/sxe-utils.h:350:2: error: #endif without #if
#endif
^
Makefile:1124: recipe for target 'movemail-regex.o' failed
make[1]: *** [movemail-regex.o] Error 1
make[1]: Leaving directory '/tmp/yaourt-tmp-solaraquarion/aur-sxemacs-git/src/build/lib-src'
Makefile:826: recipe for target 'all-recursive' failed

SolarAquarion commented on 2015-12-02 04:54

@haawda upload a compiled version?

haawda commented on 2015-11-10 10:15

Cannot reproduce. Builds fine here.

SolarAquarion commented on 2015-11-10 01:36



bin/sh: line 14: 13005 Segmentation fault (core dumped) DYLD_LIBRARY_PATH=.:./.libs:../src/ui/lwlib:../src/ui/lwlib/.libs:/usr/lib:$DYLD_LIBRARY_PATH: LD_LIBRARY_PATH=.:./.libs:../src/ui/lwlib:../src/ui/lwlib/.libs:/usr/lib:$LD_LIBRARY_PATH: SHLIB_PATH=.:./.libs:../src/ui/lwlib:../src/ui/lwlib/.libs:/usr/lib:$SHLIB_PATH: SOURCE_TREE_ROOT= BUILD_TREE_ROOT= ./sxemacs -batch -l shadow -f list-load-path-shadows

i get this then it fails

haawda commented on 2015-08-28 05:59

Fixed, thanks.

hueypokerbrainz commented on 2015-08-27 22:25

Not building for me, had to tweak PKGBUILD.

hueypokerbrainz commented on 2015-08-27 22:22

Not building for me.

$ makepkg
==> Making package: sxemacs-git 22.1.15.201.g6a46975-1 (Thu Aug 27 14:49:01 PDT 2015)
==> Checking runtime dependencies...
==> Checking buildtime dependencies...
==> Retrieving sources...

yaddah yaddah yaddah

==> Entering fakeroot environment...
==> Starting package()...
/tmp/sxemacs-git/PKGBUILD: line 41: cd: /tmp/sxemacs-git/src/sxemacs/build: No such file or directory
==> ERROR: A failure occurred in package().
Aborting...

I worked around this by changing PKGBUILD: line 41:
FROM:

cd "$srcdir/$_gitname/build"

TO:

cd "$srcdir/build"

hueypokerbrainz commented on 2015-08-27 21:42

Not building for me. Had to change line 41 of PKGBUILD
from:

cd "$srcdir/$_gitname/build"

to:

cd "$srcdir/build"

All comments