Package Details: vala-panel-git 0.3.8-1

Git Clone URL: https://aur.archlinux.org/vala-panel-git.git (read-only)
Package Base: vala-panel-git
Description: Gtk3 panel for compositing window managers
Upstream URL: https://github.com/rilian-la-te/vala-panel
Licenses: GPL3
Provides: vala-panel=${pkgver}
Submitter: rilian
Maintainer: rilian
Last Packager: rilian
Votes: 11
Popularity: 1.016962
First Submitted: 2015-04-05 15:11
Last Updated: 2017-05-08 13:08

Latest Comments

rilian commented on 2017-07-30 20:22

Rename buggy desktop file, please.

qark commented on 2016-08-27 15:23

Scanning dependencies of target applet-api-new
[ 18%] Building C object lib/applets-new/CMakeFiles/applet-api-new.dir/applet-widget.c.o
/tmp/makepkg/vala-panel-git/src/vala-panel/lib/applets-new/applet-widget.c: In function 'vala_panel_applet_widget_class_init':
/tmp/makepkg/vala-panel-git/src/vala-panel/lib/applets-new/applet-widget.c:147:22: error: 'g_cclosure_user_marshal_VOID__ENUM_INT_INT' undeclared (first use in this function)
g_cclosure_user_marshal_VOID__ENUM_INT_INT,
^~~~~~~~~~~~~~~~~~~~~~~~~~~~~~~~~~~~~~~~~~
/tmp/makepkg/vala-panel-git/src/vala-panel/lib/applets-new/applet-widget.c:147:22: note: each undeclared identifier is reported only once for each function it appears in
make[2]: *** [lib/applets-new/CMakeFiles/applet-api-new.dir/build.make:82: lib/applets-new/CMakeFiles/applet-api-new.dir/applet-widget.c.o] Error 1
make[1]: *** [CMakeFiles/Makefile2:332: lib/applets-new/CMakeFiles/applet-api-new.dir/all] Error 2
make: *** [Makefile:161: all] Error 2
==> ERROR: A failure occurred in build().
Aborting...
==> ERROR: Makepkg was unable to build vala-panel-git.

Brottweiler commented on 2016-08-07 11:55

Getting errors:

-- Checking for modules 'gtk+-3.0>=3.16;glib-2.0>=2.44;gio-2.0>=2.44;gio-unix-2.0>=2.44;gthread-2.0>=2.44;libpeas-1.0>=1.2;libpeas-gtk-1.0>=1.2;gmodule-2.0>=2.44;libuuid'
-- No package 'libuuid' found
CMake Error at /usr/share/cmake-3.6/Modules/FindPkgConfig.cmake:424 (message):
A required package was not found
Call Stack (most recent call first):
/usr/share/cmake-3.6/Modules/FindPkgConfig.cmake:597 (_pkg_check_modules_internal)
CMakeLists.txt:96 (pkg_check_modules)

Anonymous comment on 2016-07-08 15:34

add gobject-introspection to Dependencies

Anonymous comment on 2016-07-08 15:24

==> Starting prepare()...
==> Starting pkgver()...
==> Removing existing $pkgdir/ directory...
==> Starting build()...
-- The C compiler identification is GNU 6.1.1
-- Check for working C compiler: /usr/bin/cc
-- Check for working C compiler: /usr/bin/cc -- works
-- Detecting C compiler ABI info
-- Detecting C compiler ABI info - done
-- Detecting C compile features
-- Detecting C compile features - done
-- Looking for RPMTools... - rpmbuild NOT FOUND
-- Found Vala: /usr/bin/valac
-- checking for a minimum Vala version of 0.24
-- found Vala, version 0.32.1
-- Found PkgConfig: /usr/bin/pkg-config (found version "0.29.1")
-- Checking for modules 'gtk+-3.0>=3.12;glib-2.0>=2.40;gio-2.0>=2.40;gio-unix-2.0>=2.40;gthread-2.0>=2.40;libpeas-1.0>=1.2;libpeas-gtk-1.0>=1.2;gmodule-2.0>=2.40'
--
--
CMake Error at /usr/share/cmake-3.5/Modules/FindPkgConfig.cmake:363 (message):
A required package was not found
Call Stack (most recent call first):
/usr/share/cmake-3.5/Modules/FindPkgConfig.cmake:528 (_pkg_check_modules_internal)
CMakeLists.txt:95 (pkg_check_modules)


-- Configuring incomplete, errors occurred!

rilian commented on 2016-04-24 11:56

See #25 in Github, this is upstream issue.

JuHwon commented on 2016-04-24 11:52

got an error during build

gio-unix-2.0.vapi:98.4-98.13: warning: [Deprecated] is deprecated. Use [Version (deprecated = true, deprecated_since = "", replacement = "")]
gobject-2.0.vapi:157.37-157.57: error: The type name `GLib.DuplicateFunc' could not be found
public T dup_data<T> (string key, GLib.DuplicateFunc<T> dup_func);
^^^^^^^^^^^^^^^^^^^^^
gobject-2.0.vapi:160.44-160.64: error: The type name `GLib.DuplicateFunc' could not be found
public T dup_qdata<T> (GLib.Quark quark, GLib.DuplicateFunc<T> dup_func);
^^^^^^^^^^^^^^^^^^^^^
Compilation failed: 2 error(s), 49 warning(s)
lib/CMakeFiles/valapanel.dir/build.make:119: recipe for target 'lib/valapanel_valac.stamp' failed
make[2]: *** [lib/valapanel_valac.stamp] Error 1
CMakeFiles/Makefile2:206: recipe for target 'lib/CMakeFiles/valapanel.dir/all' failed
make[1]: *** [lib/CMakeFiles/valapanel.dir/all] Error 2
Makefile:160: recipe for target 'all' failed
make: *** [all] Error 2
==> ERROR: A failure occurred in build().
Aborting...
==> ERROR: Makepkg was unable to build vala-panel-git.

twa022 commented on 2016-02-18 16:31

If you're having the libpeas difficulty, it's because libpeas-1.0 and libpeas-gtk-1.0 require gobject-introspection-1.0. Maybe add gobject-introspection as a makedepends

rilian commented on 2015-10-24 19:03

If I found ArchLinux in this year, I will look for it. Now I am in the army.

freeaks commented on 2015-10-16 18:58

more of this:

i modified vala-panel-git/src/vala-panel/CMakeLists.txt
to remove version checking, instead of:
libpeas-1.0>=1.2
libpeas-gtk-1.0>=1.2
i now have:
libpeas-1.0
libpeas-gtk-1.0
so now, no more complain about version, the build starts, but then fails:
i'm getting a bit further, but:
------
[ 1%] Building C object lib/CMakeFiles/valapanel.dir/configurator.c.o
/home/freeaks/Downloads/NewDrawer/vala-panel-git/src/vala-panel/lib/configurator.c:29:26: fatal error: libpeas/peas.h: No such file or directory
------
this while pacman shows:
$ pacman -Ss libpeas
extra/libpeas 1.16.0-1 [installed]
A GObject-based plugins engine
and:
$ pacman -Ql libpeas
/usr/include/libpeas-1.0/libpeas/peas.h

it seems like required package are installed, needed files are present,
but the build process can't find them ?

All comments