Package Details: zeal-git 0.6.1.r191.g803db6a-1

Git Clone URL: https://aur.archlinux.org/zeal-git.git (read-only, click to copy)
Package Base: zeal-git
Description: A simple documentation browser
Upstream URL: https://zealdocs.org/
Keywords: api dash docs docset documentation offline
Licenses: GPL3
Conflicts: zeal
Submitter: 5long
Maintainer: trollixx
Last Packager: trollixx
Votes: 74
Popularity: 0.196817
First Submitted: 2013-06-29 09:47
Last Updated: 2020-09-06 00:01

Pinned Comments

trollixx commented on 2017-09-07 18:38

Please do not flag package out of date, unless it doesn't build. It's a Git package, the version is computed during the installation.

Latest Comments

« First ‹ Previous 1 2 3 4 5 6 Next › Last »

cewood commented on 2015-04-11 07:34

Build is failing for me, and I also get this same result also if building from the latest git checkout manually.

Apologies for the verboseness, wasn't sure what if anything I could prune out, and didn't want to leave anything important out.

/usr/bin/ld: warning: libicui18n.so.54, needed by /usr/lib/gcc/x86_64-unknown-linux-gnu/4.9.2/../../../../lib/libQt5Core.so, not found (try using -rpath or -rpath-link)
/usr/bin/ld: warning: libicuuc.so.54, needed by /usr/lib/gcc/x86_64-unknown-linux-gnu/4.9.2/../../../../lib/libQt5Core.so, not found (try using -rpath or -rpath-link)
/usr/lib/gcc/x86_64-unknown-linux-gnu/4.9.2/../../../../lib/libQt5Core.so: undefined reference to `ucal_clone_54'
/usr/lib/gcc/x86_64-unknown-linux-gnu/4.9.2/../../../../lib/libQt5Core.so: undefined reference to `uenum_next_54'
/usr/lib/gcc/x86_64-unknown-linux-gnu/4.9.2/../../../../lib/libQt5Core.so: undefined reference to `u_strToLower_54'
/usr/lib/gcc/x86_64-unknown-linux-gnu/4.9.2/../../../../lib/libQt5Core.so: undefined reference to `ucnv_getStandardName_54'
/usr/lib/gcc/x86_64-unknown-linux-gnu/4.9.2/../../../../lib/libQt5Core.so: undefined reference to `ucol_setAttribute_54'
/usr/lib/gcc/x86_64-unknown-linux-gnu/4.9.2/../../../../lib/libQt5Core.so: undefined reference to `ucal_setMillis_54'
/usr/lib/gcc/x86_64-unknown-linux-gnu/4.9.2/../../../../lib/libQt5Core.so: undefined reference to `ucol_strcoll_54'
/usr/lib/gcc/x86_64-unknown-linux-gnu/4.9.2/../../../../lib/libQt5Core.so: undefined reference to `ucnv_setSubstChars_54'
/usr/lib/gcc/x86_64-unknown-linux-gnu/4.9.2/../../../../lib/libQt5Core.so: undefined reference to `ucal_getTimeZoneDisplayName_54'
/usr/lib/gcc/x86_64-unknown-linux-gnu/4.9.2/../../../../lib/libQt5Core.so: undefined reference to `ucal_openCountryTimeZones_54'
/usr/lib/gcc/x86_64-unknown-linux-gnu/4.9.2/../../../../lib/libQt5Core.so: undefined reference to `ucnv_fromUnicode_54'
/usr/lib/gcc/x86_64-unknown-linux-gnu/4.9.2/../../../../lib/libQt5Core.so: undefined reference to `ucnv_open_54'
/usr/lib/gcc/x86_64-unknown-linux-gnu/4.9.2/../../../../lib/libQt5Core.so: undefined reference to `ucnv_getDefaultName_54'
/usr/lib/gcc/x86_64-unknown-linux-gnu/4.9.2/../../../../lib/libQt5Core.so: undefined reference to `ucol_open_54'
/usr/lib/gcc/x86_64-unknown-linux-gnu/4.9.2/../../../../lib/libQt5Core.so: undefined reference to `ucol_close_54'
/usr/lib/gcc/x86_64-unknown-linux-gnu/4.9.2/../../../../lib/libQt5Core.so: undefined reference to `ucal_inDaylightTime_54'
/usr/lib/gcc/x86_64-unknown-linux-gnu/4.9.2/../../../../lib/libQt5Core.so: undefined reference to `ucol_getSortKey_54'
/usr/lib/gcc/x86_64-unknown-linux-gnu/4.9.2/../../../../lib/libQt5Core.so: undefined reference to `ucnv_getAvailableName_54'
/usr/lib/gcc/x86_64-unknown-linux-gnu/4.9.2/../../../../lib/libQt5Core.so: undefined reference to `ucal_close_54'
/usr/lib/gcc/x86_64-unknown-linux-gnu/4.9.2/../../../../lib/libQt5Core.so: undefined reference to `ucal_get_54'
/usr/lib/gcc/x86_64-unknown-linux-gnu/4.9.2/../../../../lib/libQt5Core.so: undefined reference to `ucal_openTimeZoneIDEnumeration_54'
/usr/lib/gcc/x86_64-unknown-linux-gnu/4.9.2/../../../../lib/libQt5Core.so: undefined reference to `ucal_getDSTSavings_54'
/usr/lib/gcc/x86_64-unknown-linux-gnu/4.9.2/../../../../lib/libQt5Core.so: undefined reference to `ucal_open_54'
/usr/lib/gcc/x86_64-unknown-linux-gnu/4.9.2/../../../../lib/libQt5Core.so: undefined reference to `ucal_openTimeZones_54'
/usr/lib/gcc/x86_64-unknown-linux-gnu/4.9.2/../../../../lib/libQt5Core.so: undefined reference to `ucnv_toUnicode_54'
/usr/lib/gcc/x86_64-unknown-linux-gnu/4.9.2/../../../../lib/libQt5Core.so: undefined reference to `u_strToUpper_54'
/usr/lib/gcc/x86_64-unknown-linux-gnu/4.9.2/../../../../lib/libQt5Core.so: undefined reference to `u_errorName_54'
/usr/lib/gcc/x86_64-unknown-linux-gnu/4.9.2/../../../../lib/libQt5Core.so: undefined reference to `ucnv_close_54'
/usr/lib/gcc/x86_64-unknown-linux-gnu/4.9.2/../../../../lib/libQt5Core.so: undefined reference to `uenum_close_54'
/usr/lib/gcc/x86_64-unknown-linux-gnu/4.9.2/../../../../lib/libQt5Core.so: undefined reference to `ucnv_countAvailable_54'
/usr/lib/gcc/x86_64-unknown-linux-gnu/4.9.2/../../../../lib/libQt5Core.so: undefined reference to `ucnv_getMaxCharSize_54'
/usr/lib/gcc/x86_64-unknown-linux-gnu/4.9.2/../../../../lib/libQt5Core.so: undefined reference to `ucnv_getAlias_54'
/usr/lib/gcc/x86_64-unknown-linux-gnu/4.9.2/../../../../lib/libQt5Core.so: undefined reference to `ucal_getDefaultTimeZone_54'
/usr/lib/gcc/x86_64-unknown-linux-gnu/4.9.2/../../../../lib/libQt5Core.so: undefined reference to `ucnv_compareNames_54'
/usr/lib/gcc/x86_64-unknown-linux-gnu/4.9.2/../../../../lib/libQt5Core.so: undefined reference to `ucnv_countAliases_54'
collect2: error: ld returned 1 exit status
Makefile:228: recipe for target '../bin/zeal' failed
make[1]: *** [../bin/zeal] Error 1
make[1]: Leaving directory '/tmp/zeal-git/src/zeal/src'
Makefile:42: recipe for target 'sub-src-make_first-ordered' failed
make: *** [sub-src-make_first-ordered] Error 2

trollixx commented on 2015-01-12 22:17

The build problem should be fixed now.

chaopeng commented on 2015-01-12 15:09

fix for The folder structure has changed the zeal directory is changed to src so there is an error on PKGBUILD: line 27

build() {
- cd ${srcdir}/${_appname}/${_appname}
+ cd ${srcdir}/${_appname}
qmake PREFIX=/usr CONFIG+=no_libappindicator
make
}

package() {
- cd ${srcdir}/${_appname}/${_appname}
+ cd ${srcdir}/${_appname}
make INSTALL_ROOT="$pkgdir" install
}

chaopeng commented on 2015-01-12 15:08

fix for The folder structure has changed the zeal directory is changed to src so there is an error on PKGBUILD: line 27

build() {
- cd ${srcdir}/${_appname}/${_appname}
+ cd ${srcdir}/${_appname}
qmake PREFIX=/usr CONFIG+=no_libappindicator
make
}

package() {
- cd ${srcdir}/${_appname}/${_appname}
+ cd ${srcdir}/${_appname}
make INSTALL_ROOT="$pkgdir" install
}

Anonymous comment on 2015-01-12 10:03

The folder structure has changed the zeal directory is changed to src so there is an error on PKGBUILD: line 27

trollixx commented on 2015-01-06 02:49

@FrenchToasts, thanks for reporting the problem. I have submitted the fixed PKGBUILD.

FrenchToasts commented on 2015-01-06 01:46

There is an error while parsing the PKGBUILD:
==> ERROR: arch contains invalid characters: ','

It doesn't seem to like that there is a comma on this line: arch=('i686', 'x86_64')

To temporarily fix the issue, I changed the above line to:

arch=('x86_64')

Anonymous comment on 2014-11-03 12:06

Build fails for me with the error message, that it is not buidable for i686.

Spoffy commented on 2014-10-19 13:40

+1 for the "CONFIG+=no_libappindicator" option. The build worked fine for me after that.

emlcj commented on 2014-09-16 05:13

+1 working well with adding "CONFIG+=no_libappindicator" in PKG qmake line