Package Details: balena-etcher 2:2.1.0-1

Git Clone URL: https://aur.archlinux.org/balena-etcher.git (read-only, click to copy)
Package Base: balena-etcher
Description: Flash OS images to SD cards & USB drives, safely and easily
Upstream URL: https://balena.io/etcher
Licenses: Apache-2.0
Conflicts: etcher, etcher-bin, etcher-git
Submitter: gin078
Maintainer: zhullyb (Clansty, sukanka, lilac)
Last Packager: sukanka
Votes: 263
Popularity: 0.85
First Submitted: 2019-05-13 11:35 (UTC)
Last Updated: 2025-03-01 03:02 (UTC)

Latest Comments

« First ‹ Previous 1 2 3 4 5 6 7 8 9 10 .. 30 Next › Last »

WhiredPlanck commented on 2022-11-24 05:31 (UTC)

@blabred Please upgrade your system and restart then retry.

blabred commented on 2022-11-14 18:33 (UTC)

Got this error while trying to update:

git submodule update --init && \
npm ci && \
npm run webpack
node: error while loading shared libraries: libicui18n.so.71: cannot open shared object file: No such file or directory
make: *** [Makefile:92: electron-develop] Error 127
==> ERROR: Se produjo un fallo en build().
    Cancelando...
 -> error compilando: balena-etcher

jodema commented on 2022-11-14 17:12 (UTC)

I am also still having the same issue that emceebois posted 6 days ago and SpineEyE commented on yesterday. Any ideas why and how to fix it?

SpineEyE commented on 2022-11-13 20:41 (UTC)

I stil have the same issue that emceebois posted 5 days ago. Does anyone have any clue why this happens?

emceebois commented on 2022-11-08 18:54 (UTC) (edited on 2022-11-14 20:41 (UTC) by emceebois)

I'm getting the following error trying to update this with yay today:

[10:51:05] Webpack (10%) - Build modules

/home/username/.cache/yay/balena-etcher/src/etcher/node_modules/loader-runner/lib/LoaderRunner.js:119
                        throw new Error("callback(): The callback was already called.");
         ^
Error: callback(): The callback was already called.
    at context.callback (/home/username/.cache/yay/balena-etcher/src/etcher/node_modules/loader-runner/lib/LoaderRunner.js:119:10)
    at Object.ESBuildLoader (/home/username/.cache/yay/balena-etcher/src/etcher/node_modules/esbuild-loader/dist/loader.js:62:9)
    at processTicksAndRejections (node:internal/process/task_queues:96:5)
make: *** [Makefile:92: electron-develop] Error 1
==> ERROR: A failure occurred in build().
    Aborting...
 -> error making: balena-etcher

EDIT: Confirming that this is still an issue as of the 2022-11-13 update. Thank you to SpineEyE and jodema for confirming replication of this bug. If a maintainer needs additional logs or system information in order to diagnose the problem, please let me know and I will be happy to assist.

yurikoles commented on 2022-11-08 03:27 (UTC)

Upstream issues releases like crazy today, seems to be due to switch to some flowzone GHA stack.

nTia89 commented on 2022-09-17 15:07 (UTC)

Every time I update balena, F1 functionality get broken; there is a plethora of issues reported upstream but I will not be fixed there, here is one [https://github.com/balena-io/etcher/issues/3404]. I suggest we can add an easy message on installation/upgrade with a simple command like this one xdg-mime default firefox.desktop text/html

jal666 commented on 2022-07-19 10:56 (UTC)

/usr/bin/balnela-etcher-electron to launch (put as an alias 'etcher' maybe)

damdam_kr commented on 2022-07-05 12:11 (UTC)

Anybody getting this?

node: error while loading shared libraries: libicui18n.so.70: cannot open shared object file: No such file or directory make: *** [Makefile:92: electron-develop] Error 127 ==> ERROR: A failure occurred in build(). Aborting... error: failed to build 'balena-etcher-2:1.7.9-1': error: packages failed to build: balena-etcher-2:1.7.9-1

neoarch666 commented on 2022-04-09 12:58 (UTC) (edited on 2022-04-09 13:58 (UTC) by neoarch666)

Hello my problem of compil Balnela-etcher resolve when i install all dependency (optionally) of electon12 (i using pamac-aur or pamac-gtk app for see it) the name of dependency is "trash-cli" and "kde-cli-tools" but i think is just trash-cli missing and i must instaled it