Package Details: jabref-git 2:5.1.r275.g74ca49422e-1

Git Clone URL: https://aur.archlinux.org/jabref-git.git (read-only, click to copy)
Package Base: jabref-git
Description: GUI frontend for BibTeX, written in Java -- built from git
Upstream URL: https://www.jabref.org
Licenses: MIT
Conflicts: jabref
Provides: jabref
Submitter: haawda
Maintainer: haawda
Last Packager: haawda
Votes: 13
Popularity: 0.017011
First Submitted: 2012-03-20 17:01
Last Updated: 2020-11-21 10:44

Required by (0)

Sources (3)

Pinned Comments

haawda commented on 2020-10-04 22:33

Please uninstall java-openjfx when building this package.

Latest Comments

1 2 3 4 5 Next › Last »

haawda commented on 2020-10-04 22:33

Please uninstall java-openjfx when building this package.

haawda commented on 2020-10-04 22:32

pacman does not support negative makedepends yet, and the package technically does not conflict to java-openjfx, as it does not share any files with it. See the comment in line 19 of the PKGBUILD.

jksimek commented on 2020-10-04 18:54

Compilation succeeded after I removed java-openjfx. Perhaps this package should be added to conflicts?

jksimek commented on 2020-10-04 17:41

Build fails:

> Task :jlink FAILED
Error: Modules org.jabref.merged.module and javafx.fxml export package javafx.fxml to module org.jabref
FAILURE: Build failed with an exception.
* What went wrong:
Execution failed for task ':jlink'.
> Process 'command '/usr/lib/jvm/java-14-openjdk/bin/jlink'' finished with non-zero exit value 1

I have extra/java-openjfx 14.0.2.u0-2 and extra/jdk-openjdk 14.0.2.u12-1 installed.

haawda commented on 2020-08-18 19:57

Fixed.

haawda commented on 2020-08-18 12:17

The main reason for removing these lines was that there no longer is a build/image subdir after the "gradlew jlink" step stopped working.

But I must confess that the current TAURBALL is broken. I have to look deeper into it.

MichaelSx commented on 2020-08-18 06:30

I had to re-add the following lines to the build() section of the PKGBUILD. Is there a specific reason why they have been removed?

install -d "${pkgdir}/opt"
cp -R ${pkgname%-git}/build/image "$pkgdir"/opt/jabref

Flickster commented on 2020-07-20 09:46

There is currently a checksum issue. The checksum of jabref.sh should still be f17e5184be3541c7c6f54516ee71e0935516c3f36f8c4ecf780999834f88fb0d.

==> Validating source files with sha256sums...
    jabref ... Skipped
    jabref.desktop ... Passed
    jabref.sh ... FAILED
==> ERROR: One or more files did not pass the validity check!

Anonymous comment on 2019-10-02 12:56

* Exception is:
org.gradle.api.tasks.TaskExecutionException: Execution failed for task ':jlink'.
    at org.gradle.api.internal.tasks.execution.ExecuteActionsTaskExecuter$3.accept(ExecuteActionsTaskExecuter.java:166)
    at org.gradle.api.internal.tasks.execution.ExecuteActionsTaskExecuter$3.accept(ExecuteActionsTaskExecuter.java:163)
    at org.gradle.internal.Try$Failure.ifSuccessfulOrElse(Try.java:191)
    at org.gradle.api.internal.tasks.execution.ExecuteActionsTaskExecuter.execute(ExecuteActionsTaskExecuter.java:156)
    at org.gradle.api.internal.tasks.execution.ValidatingTaskExecuter.execute(ValidatingTaskExecuter.java:62)
    at org.gradle.api.internal.tasks.execution.SkipEmptySourceFilesTaskExecuter.execute(SkipEmptySourceFilesTaskExecuter.java:108)
    at org.gradle.api.internal.tasks.execution.ResolveBeforeExecutionOutputsTaskExecuter.execute(ResolveBeforeExecutionOutputsTaskExecuter.java:67)
    at org.gradle.api.internal.tasks.execution.StartSnapshotTaskInputsBuildOperationTaskExecuter.execute(StartSnapshotTaskInputsBuildOperationTaskExecuter.java:62)
    at org.gradle.api.internal.tasks.execution.ResolveAfterPreviousExecutionStateTaskExecuter.execute(ResolveAfterPreviousExecutionStateTaskExecuter.java:46)
    at org.gradle.api.internal.tasks.execution.CleanupStaleOutputsExecuter.execute(CleanupStaleOutputsExecuter.java:94)
    at org.gradle.api.internal.tasks.execution.FinalizePropertiesTaskExecuter.execute(FinalizePropertiesTaskExecuter.java:46)
    at org.gradle.api.internal.tasks.execution.ResolveTaskExecutionModeExecuter.execute(ResolveTaskExecutionModeExecuter.java:95)
    at org.gradle.api.internal.tasks.execution.SkipTaskWithNoActionsExecuter.execute(SkipTaskWithNoActionsExecuter.java:57)
    at org.gradle.api.internal.tasks.execution.SkipOnlyIfTaskExecuter.execute(SkipOnlyIfTaskExecuter.java:56)
    at org.gradle.api.internal.tasks.execution.CatchExceptionTaskExecuter.execute(CatchExceptionTaskExecuter.java:36)
    at org.gradle.api.internal.tasks.execution.EventFiringTaskExecuter$1.executeTask(EventFiringTaskExecuter.java:77)
    at org.gradle.api.internal.tasks.execution.EventFiringTaskExecuter$1.call(EventFiringTaskExecuter.java:55)
    at org.gradle.api.internal.tasks.execution.EventFiringTaskExecuter$1.call(EventFiringTaskExecuter.java:52)
    at org.gradle.internal.operations.DefaultBuildOperationExecutor$CallableBuildOperationWorker.execute(DefaultBuildOperationExecutor.java:416)
    at org.gradle.internal.operations.DefaultBuildOperationExecutor$CallableBuildOperationWorker.execute(DefaultBuildOperationExecutor.java:406)
    at org.gradle.internal.operations.DefaultBuildOperationExecutor$1.execute(DefaultBuildOperationExecutor.java:165)
    at org.gradle.internal.operations.DefaultBuildOperationExecutor.execute(DefaultBuildOperationExecutor.java:250)
    at org.gradle.internal.operations.DefaultBuildOperationExecutor.execute(DefaultBuildOperationExecutor.java:158)
    at org.gradle.internal.operations.DefaultBuildOperationExecutor.call(DefaultBuildOperationExecutor.java:102)
    at org.gradle.internal.operations.DelegatingBuildOperationExecutor.call(DelegatingBuildOperationExecutor.java:36)
    at org.gradle.api.internal.tasks.execution.EventFiringTaskExecuter.execute(EventFiringTaskExecuter.java:52)
    at org.gradle.execution.plan.LocalTaskNodeExecutor.execute(LocalTaskNodeExecutor.java:43)
    at org.gradle.execution.taskgraph.DefaultTaskExecutionGraph$InvokeNodeExecutorsAction.execute(DefaultTaskExecutionGraph.java:355)
    at org.gradle.execution.taskgraph.DefaultTaskExecutionGraph$InvokeNodeExecutorsAction.execute(DefaultTaskExecutionGraph.java:343)
    at org.gradle.execution.taskgraph.DefaultTaskExecutionGraph$BuildOperationAwareExecutionAction.execute(DefaultTaskExecutionGraph.java:336)
    at org.gradle.execution.taskgraph.DefaultTaskExecutionGraph$BuildOperationAwareExecutionAction.execute(DefaultTaskExecutionGraph.java:322)
    at org.gradle.execution.plan.DefaultPlanExecutor$ExecutorWorker$1.execute(DefaultPlanExecutor.java:134)
    at org.gradle.execution.plan.DefaultPlanExecutor$ExecutorWorker$1.execute(DefaultPlanExecutor.java:129)
    at org.gradle.execution.plan.DefaultPlanExecutor$ExecutorWorker.execute(DefaultPlanExecutor.java:202)
    at org.gradle.execution.plan.DefaultPlanExecutor$ExecutorWorker.executeNextNode(DefaultPlanExecutor.java:193)
    at org.gradle.execution.plan.DefaultPlanExecutor$ExecutorWorker.run(DefaultPlanExecutor.java:129)
    at org.gradle.internal.concurrent.ExecutorPolicy$CatchAndRecordFailures.onExecute(ExecutorPolicy.java:64)
    at org.gradle.internal.concurrent.ManagedExecutorImpl$1.run(ManagedExecutorImpl.java:48)
    at org.gradle.internal.concurrent.ThreadFactoryImpl$ManagedThreadRunnable.run(ThreadFactoryImpl.java:56)
Caused by: org.gradle.process.internal.ExecException: Process 'command '/usr/lib/jvm/java-11-openjdk/bin/jlink'' finished with non-zero exit value 1
    at org.gradle.process.internal.DefaultExecHandle$ExecResultImpl.assertNormalExitValue(DefaultExecHandle.java:409)
    at org.gradle.process.ExecResult$assertNormalExitValue.call(Unknown Source)
    at org.beryx.jlink.impl.JlinkTaskImpl.runJlink(JlinkTaskImpl.groovy:83)
    at org.beryx.jlink.impl.JlinkTaskImpl.execute(JlinkTaskImpl.groovy:52)
    at org.beryx.jlink.JlinkTask.jlinkTaskAction(JlinkTask.groovy:120)
    at java.base/jdk.internal.reflect.NativeMethodAccessorImpl.invoke0(Native Method)
    at java.base/jdk.internal.reflect.NativeMethodAccessorImpl.invoke(NativeMethodAccessorImpl.java:62)
    at java.base/jdk.internal.reflect.DelegatingMethodAccessorImpl.invoke(DelegatingMethodAccessorImpl.java:43)
    at org.gradle.internal.reflect.JavaMethod.invoke(JavaMethod.java:103)
    at org.gradle.api.internal.project.taskfactory.StandardTaskAction.doExecute(StandardTaskAction.java:49)
    at org.gradle.api.internal.project.taskfactory.StandardTaskAction.execute(StandardTaskAction.java:42)
    at org.gradle.api.internal.project.taskfactory.StandardTaskAction.execute(StandardTaskAction.java:28)
    at org.gradle.api.internal.AbstractTask$TaskActionWrapper.execute(AbstractTask.java:717)
    at org.gradle.api.internal.AbstractTask$TaskActionWrapper.execute(AbstractTask.java:684)
    at org.gradle.api.internal.tasks.execution.ExecuteActionsTaskExecuter$5.run(ExecuteActionsTaskExecuter.java:476)
    at org.gradle.internal.operations.DefaultBuildOperationExecutor$RunnableBuildOperationWorker.execute(DefaultBuildOperationExecutor.java:402)
    at org.gradle.internal.operations.DefaultBuildOperationExecutor$RunnableBuildOperationWorker.execute(DefaultBuildOperationExecutor.java:394)
    at org.gradle.internal.operations.DefaultBuildOperationExecutor$1.execute(DefaultBuildOperationExecutor.java:165)
    at org.gradle.internal.operations.DefaultBuildOperationExecutor.execute(DefaultBuildOperationExecutor.java:250)
    at org.gradle.internal.operations.DefaultBuildOperationExecutor.execute(DefaultBuildOperationExecutor.java:158)
    at org.gradle.internal.operations.DefaultBuildOperationExecutor.run(DefaultBuildOperationExecutor.java:92)
    at org.gradle.internal.operations.DelegatingBuildOperationExecutor.run(DelegatingBuildOperationExecutor.java:31)
    at org.gradle.api.internal.tasks.execution.ExecuteActionsTaskExecuter.executeAction(ExecuteActionsTaskExecuter.java:461)
    at org.gradle.api.internal.tasks.execution.ExecuteActionsTaskExecuter.executeActions(ExecuteActionsTaskExecuter.java:444)
    at org.gradle.api.internal.tasks.execution.ExecuteActionsTaskExecuter.access$200(ExecuteActionsTaskExecuter.java:93)
    at org.gradle.api.internal.tasks.execution.ExecuteActionsTaskExecuter$TaskExecution.execute(ExecuteActionsTaskExecuter.java:237)
    at org.gradle.internal.execution.steps.ExecuteStep.lambda$execute$1(ExecuteStep.java:33)
    at org.gradle.internal.execution.steps.ExecuteStep.execute(ExecuteStep.java:33)
    at org.gradle.internal.execution.steps.ExecuteStep.execute(ExecuteStep.java:26)
    at org.gradle.internal.execution.steps.CleanupOutputsStep.execute(CleanupOutputsStep.java:58)
    at org.gradle.internal.execution.steps.CleanupOutputsStep.execute(CleanupOutputsStep.java:35)
    at org.gradle.internal.execution.steps.ResolveInputChangesStep.execute(ResolveInputChangesStep.java:48)
    at org.gradle.internal.execution.steps.ResolveInputChangesStep.execute(ResolveInputChangesStep.java:33)
    at org.gradle.internal.execution.steps.CancelExecutionStep.execute(CancelExecutionStep.java:39)
    at org.gradle.internal.execution.steps.TimeoutStep.executeWithoutTimeout(TimeoutStep.java:73)
    at org.gradle.internal.execution.steps.TimeoutStep.execute(TimeoutStep.java:54)
    at org.gradle.internal.execution.steps.CatchExceptionStep.execute(CatchExceptionStep.java:35)
    at org.gradle.internal.execution.steps.CreateOutputsStep.execute(CreateOutputsStep.java:51)
    at org.gradle.internal.execution.steps.SnapshotOutputsStep.execute(SnapshotOutputsStep.java:45)
    at org.gradle.internal.execution.steps.SnapshotOutputsStep.execute(SnapshotOutputsStep.java:31)
    at org.gradle.internal.execution.steps.CacheStep.executeWithoutCache(CacheStep.java:208)
    at org.gradle.internal.execution.steps.CacheStep.execute(CacheStep.java:70)
    at org.gradle.internal.execution.steps.CacheStep.execute(CacheStep.java:45)
    at org.gradle.internal.execution.steps.BroadcastChangingOutputsStep.execute(BroadcastChangingOutputsStep.java:49)
    at org.gradle.internal.execution.steps.StoreSnapshotsStep.execute(StoreSnapshotsStep.java:43)
    at org.gradle.internal.execution.steps.StoreSnapshotsStep.execute(StoreSnapshotsStep.java:32)
    at org.gradle.internal.execution.steps.RecordOutputsStep.execute(RecordOutputsStep.java:38)
    at org.gradle.internal.execution.steps.RecordOutputsStep.execute(RecordOutputsStep.java:24)
    at org.gradle.internal.execution.steps.SkipUpToDateStep.executeBecause(SkipUpToDateStep.java:96)
    at org.gradle.internal.execution.steps.SkipUpToDateStep.lambda$execute$0(SkipUpToDateStep.java:89)
    at org.gradle.internal.execution.steps.SkipUpToDateStep.execute(SkipUpToDateStep.java:54)
    at org.gradle.internal.execution.steps.SkipUpToDateStep.execute(SkipUpToDateStep.java:38)
    at org.gradle.internal.execution.steps.ResolveChangesStep.execute(ResolveChangesStep.java:76)
    at org.gradle.internal.execution.steps.ResolveChangesStep.execute(ResolveChangesStep.java:37)
    at org.gradle.internal.execution.steps.legacy.MarkSnapshottingInputsFinishedStep.execute(MarkSnapshottingInputsFinishedStep.java:36)
    at org.gradle.internal.execution.steps.legacy.MarkSnapshottingInputsFinishedStep.execute(MarkSnapshottingInputsFinishedStep.java:26)
    at org.gradle.internal.execution.steps.ResolveCachingStateStep.execute(ResolveCachingStateStep.java:90)
    at org.gradle.internal.execution.steps.ResolveCachingStateStep.execute(ResolveCachingStateStep.java:48)
    at org.gradle.internal.execution.steps.CaptureStateBeforeExecutionStep.execute(CaptureStateBeforeExecutionStep.java:69)
    at org.gradle.internal.execution.steps.CaptureStateBeforeExecutionStep.execute(CaptureStateBeforeExecutionStep.java:47)
    at org.gradle.internal.execution.impl.DefaultWorkExecutor.execute(DefaultWorkExecutor.java:33)
    at org.gradle.api.internal.tasks.execution.ExecuteActionsTaskExecuter.execute(ExecuteActionsTaskExecuter.java:140)
    ... 35 more


* Get more help at https://help.gradle.org

Deprecated Gradle features were used in this build, making it incompatible with Gradle 6.0.
Use '--warning-mode all' to show the individual deprecation warnings.
See https://docs.gradle.org/5.6/userguide/command_line_interface.html#sec:command_line_warnings

BUILD FAILED in 2m 12s
14 actionable tasks: 5 executed, 9 up-to-date

haawda commented on 2019-09-21 14:50

I was able to build jabref and run with this PKGBUILD, but I needed to uninstall java11-openjfx first. With java11-openjfx installed the build fails.