Package Details: lxqt-session-git 0.13.0.172.gd41de44-2

Git Clone URL: https://aur.archlinux.org/lxqt-session-git.git (read-only, click to copy)
Package Base: lxqt-session-git
Description: LXQt session
Upstream URL: https://lxqt.org
Licenses: GPL2
Conflicts: lxqt-session
Provides: lxqt-session=0.13.0.172.gd41de44
Submitter: jleclanche
Maintainer: jleclanche (yan12125)
Last Packager: yan12125
Votes: 34
Popularity: 0.000000
First Submitted: 2014-01-26 16:13
Last Updated: 2018-09-16 02:29

Latest Comments

« First ‹ Previous 1 2 3 Next › Last »

muruthegun commented on 2015-09-29 13:10

Build failing for me:


[ 92%] Building CXX object lxqt-config-session/CMakeFiles/lxqt-config-session.dir/autostartpage.cpp.o
[ 93%] Building CXX object lxqt-config-session/CMakeFiles/lxqt-config-session.dir/autostartmodel.cpp.o
[ 94%] Linking CXX executable lxqt-session
/usr/bin/ld: CMakeFiles/lxqt-session.dir/src/numlock.cpp.o: undefined reference to symbol 'XkbLockModifiers'
/usr/lib/libX11.so.6: error adding symbols: DSO missing from command line
collect2: error: ld returned 1 exit status
lxqt-session/CMakeFiles/lxqt-session.dir/build.make:479: recipe for target 'lxqt-session/lxqt-session' failed
make[2]: *** [lxqt-session/lxqt-session] Error 1
CMakeFiles/Makefile2:86: recipe for target 'lxqt-session/CMakeFiles/lxqt-session.dir/all' failed
make[1]: *** [lxqt-session/CMakeFiles/lxqt-session.dir/all] Error 2
make[1]: *** Waiting for unfinished jobs....
[ 94%] Building CXX object lxqt-config-session/CMakeFiles/lxqt-config-session.dir/autostartitem.cpp.o
[ 95%] Building CXX object lxqt-config-session/CMakeFiles/lxqt-config-session.dir/autostartedit.cpp.o
[ 96%] Building CXX object lxqt-config-session/CMakeFiles/lxqt-config-session.dir/defaultappspage.cpp.o
[ 97%] Building CXX object lxqt-config-session/CMakeFiles/lxqt-config-session.dir/environmentpage.cpp.o
[ 98%] Building CXX object lxqt-config-session/CMakeFiles/lxqt-config-session.dir/__/lxqt-session/src/windowmanager.cpp.o
[ 98%] Building CXX object lxqt-config-session/CMakeFiles/lxqt-config-session.dir/LXQtAppTranslationLoader.cpp.o
[ 99%] Building CXX object lxqt-config-session/CMakeFiles/lxqt-config-session.dir/lxqt-config-session_automoc.cpp.o
[100%] Linking CXX executable lxqt-config-session
[100%] Built target lxqt-config-session
Makefile:149: recipe for target 'all' failed
make: *** [all] Error 2
==> ERROR: A failure occurred in build().
Aborting...
==> ERROR: Makepkg was unable to build lxqt-session-git.

anton-tsyganenko commented on 2014-11-03 20:25

Thanks, it's working now.

paulolieuthier commented on 2014-11-03 20:22

Please try it now.

anton-tsyganenko commented on 2014-11-03 19:45

I can't build it:

[ 46%] Building CXX object lxqt-session/CMakeFiles/lxqt-session.dir/lxqt-session_automoc.cpp.o
Linking CXX executable lxqt-session
/usr/bin/ld: CMakeFiles/lxqt-session.dir/src/sessionapplication.cpp.o: undefined reference to symbol 'XSetPointerMapping'
/usr/lib/libX11.so.6: error adding symbols: DSO missing from command line
collect2: error: ld returned 1 exit status
lxqt-session/CMakeFiles/lxqt-session.dir/build.make:437: recipe for target 'lxqt-session/lxqt-session' failed
make[2]: *** [lxqt-session/lxqt-session] Error 1
CMakeFiles/Makefile2:173: recipe for target 'lxqt-session/CMakeFiles/lxqt-session.dir/all' failed
make[1]: *** [lxqt-session/CMakeFiles/lxqt-session.dir/all] Error 2
Makefile:137: recipe for target 'all' failed
make: *** [all] Error 2
==> ERROR: A failure occurred in build().
Aborting...

ArchGiac commented on 2014-10-14 20:45

Solved! I have removed and reinstalled everything. Thanks anyway

jleclanche commented on 2014-10-14 19:47

It's working fine here, don't know what to tell you.

ArchGiac commented on 2014-10-14 18:43

Nothing has changed :(

ArchGiac commented on 2014-10-14 18:34

At this time an update is released: aur/libqtxdg-git 1.0.0.2.g456069a-1 1 -> 2.
I try to update

ArchGiac commented on 2014-10-14 18:26

I found this topic in the forum: https://bbs.archlinux.org/viewtopic.php?pid=1465660

ArchGiac commented on 2014-10-14 18:25

No, unfortunately nothing has changed.
In fact, the library looking for is not present.
Sorry for my english