Package Details: aom-git 1.0.0.r295.g8853196577-1

Git Clone URL: https://aur.archlinux.org/aom-git.git (read-only)
Package Base: aom-git
Description: An open, royalty-free video coding format designed for video transmissions over the Internet
Upstream URL: https://aomedia.org/
Licenses: BSD, custom:PATENTS
Conflicts: aom
Provides: aom
Submitter: Chocobo1
Maintainer: Chocobo1
Last Packager: Chocobo1
Votes: 6
Popularity: 0.892739
First Submitted: 2018-01-14 07:21
Last Updated: 2018-08-02 16:26

Required by (10)

Sources (1)

Latest Comments

1 2 Next › Last »

francoism90 commented on 2018-07-02 07:52

This should be merged with libaom-git, they are basically the same.

Eschwartz commented on 2018-06-17 13:03

spider-mario: that's a namcap bug, since it does not have any code to handle the base group and more importantly, no one has ever been able to agree on whether to include base packages or not.

To put it another way... if you create a bug report saying that some package is missing a dependency on base packages, I'll close it with the rejection message "we've got no policy to add any such thing". OTOH we've got no rule that says you're forbidden to add it. It's a personal choice of the maintainer.

FWIW the canonical instructions for installing Arch Linux tell you to install the base group, and the makepkg article states that base-devel should not be listed as makedepends but states about base, that it is "assumed installed on all Arch systems", not "on any Arch system that is being used to run makepkg".

spider-mario commented on 2018-05-29 21:55

Actually, libaom-git also contains the executable, just like libwebp or libvpx.

dreieck commented on 2018-05-15 13:01

Fails to build for me:

[...]
Scanning dependencies of target aom_av1_decoder
[ 47%] Building C object CMakeFiles/aom_av1_decoder.dir/av1/av1_dx_iface.c.o
[ 48%] Building C object CMakeFiles/aom_av1_decoder.dir/av1/decoder/decodeframe.c.o
[ 48%] Building C object CMakeFiles/aom_av1_decoder.dir/av1/decoder/decodemv.c.o
[ 48%] Building C object CMakeFiles/aom_av1_decoder.dir/av1/decoder/decoder.c.o
[ 48%] Building C object CMakeFiles/aom_av1_decoder.dir/av1/decoder/detokenize.c.o
[ 49%] Building C object CMakeFiles/aom_av1_decoder.dir/av1/decoder/dthread.c.o
[ 49%] Building C object CMakeFiles/aom_av1_decoder.dir/av1/decoder/obu.c.o
/var/tmp/yaourt-tmp-felics/aur-libaom-git/src/aom/av1/decoder/obu.c: In function ‘read_sequence_header_obu’:
/var/tmp/yaourt-tmp-felics/aur-libaom-git/src/aom/av1/decoder/obu.c:188:37: error: ‘AV1_COMMON’ {aka ‘struct AV1Common’} has no member named ‘enhancement_layers_cnt’
       operating_point >= pbi->common.enhancement_layers_cnt)
                                     ^
make[2]: *** [CMakeFiles/aom_av1_decoder.dir/build.make:141: CMakeFiles/aom_av1_decoder.dir/av1/decoder/obu.c.o] Error 1
make[1]: *** [CMakeFiles/Makefile2:1559: CMakeFiles/aom_av1_decoder.dir/all] Error 2
make: *** [Makefile:130: all] Error 2
==> ERROR: A failure occurred in build().
    Aborting...

Chocobo1 commented on 2018-05-13 14:57

What does this package bring over the existing libaom-git?

I suppose the name libaom-git is more like a library targeting developers, while this one provide the codec executable (and the library too).

spider-mario commented on 2018-05-13 14:49

@IncredibleLaser: the wiki only mentions that packages in the AUR can assume that base{,-devel} are installed when building packages. That does not imply that the resulting packages (which could be installed by others) can omit packages in base in their runtime dependencies (and indeed, repo packages don’t, and namcap complains if you do).

spider-mario commented on 2018-05-13 14:46

What does this package bring over the existing libaom-git?

DetMittens commented on 2018-05-08 14:09

Thanks for spotting that, I've fixed it with the latest update.

DrZaius commented on 2018-05-07 22:15

-DCONIFG_SHARED=1 looks like a typo for -DCONFIG_SHARED=1.

Nothing4You commented on 2018-04-17 05:46

Please fix the dependencies:

Checking C compiler flag support for: -D_FILE_OFFSET_BITS=64
-- Performing Test C_FLAG_SUPPORTED
-- Performing Test C_FLAG_SUPPORTED - Success
Checking C++ compiler flag support for: -D_FILE_OFFSET_BITS=64
-- Performing Test CXX_FLAG_SUPPORTED
-- Performing Test CXX_FLAG_SUPPORTED - Success
-- Could NOT find PythonInterp (missing: PYTHON_EXECUTABLE)
-- Could NOT find PythonInterp (missing: PYTHON_EXECUTABLE)
CMake Error at test/test.cmake:307 (message):
  --- Unit tests require Python, rerun cmake with -DCONFIG_UNIT_TESTS=0 to
  avoid this error, or install Python and make sure it's in your PATH.
Call Stack (most recent call first):
  CMakeLists.txt:82 (include)


-- Configuring incomplete, errors occurred!
See also "/build/aom-git/src/aom/_build/CMakeFiles/CMakeOutput.log".
See also "/build/aom-git/src/aom/_build/CMakeFiles/CMakeError.log".
==> ERROR: A failure occurred in build().
    Aborting...
==> ERROR: Build failed, check /var/lib/aurbuild/x86_64/$USER/build