Package Details: intel-media-sdk-git 2022.4.4.r3.ge0fb307c-1

Git Clone URL: (read-only, click to copy)
Package Base: intel-media-sdk-git
Description: Legacy API for hardware video acceleration on Intel GPUs (Broadwell to Rocket Lake) (git version)
Upstream URL:
Keywords: hwaccel intel libmfx media mediasdk mfx qsv quicksync quicksyncvideo sdk video
Licenses: MIT
Conflicts: intel-media-sdk
Provides: intel-media-sdk, onevpl-runtime
Submitter: dbermond
Maintainer: dbermond
Last Packager: dbermond
Votes: 24
Popularity: 0.000000
First Submitted: 2017-12-27 20:14 (UTC)
Last Updated: 2022-07-03 01:59 (UTC)

Required by (32)

Sources (2)

Latest Comments

dbermond commented on 2021-10-05 20:26 (UTC)

@NobodyDBG I cannot reproduce your issue. Package is building fine. Please make sure that you have an up-to-date libva-git package installed. Probably you are building against an old one.

NobodyDBG commented on 2021-10-03 17:33 (UTC)

@dbermond I use Arch Linux. With makepkg I got the same error.

dbermond commented on 2021-09-04 14:23 (UTC)

@NobodyDBG Your log shows that you are still using an AUR helper (and not makepkg), since there are references to 'yay'. AUR helpers are not supported. Are you using Arch Linux or an Arch derivative?

NobodyDBG commented on 2021-08-27 08:52 (UTC) (edited on 2021-08-27 08:53 (UTC) by NobodyDBG)

@dbermond Build with makepkg:

[ 81%] Built target mfxhw_static make[2]: Leaving directory '/ramdisk/yay/intel-media-sdk-git/src/build' [ 86%] Built target mfx_h264la_hw64 /ramdisk/yay/intel-media-sdk-git/src/MediaSDK/_studio/mfx_lib/encode_hw/hevc/linux/base/hevcehw_base_weighted_prediction_lin.cpp: In lambda function: /ramdisk/yay/intel-media-sdk-git/src/MediaSDK/_studio/mfx_lib/encode_hw/hevc/linux/base/hevcehw_base_weighted_prediction_lin.cpp:60:19: error: 'VAEncSliceParameterBufferHEVC' has no member named 'pred_weight_table_bit_offset' 60 | slice.pred_weight_table_bit_offset = itSSH->; | ^~~~~~~~~~~~~~~~~~~~~~~~~~~~ /ramdisk/yay/intel-media-sdk-git/src/MediaSDK/_studio/mfx_lib/encode_hw/hevc/linux/base/hevcehw_base_weighted_prediction_lin.cpp:61:19: error: 'VAEncSliceParameterBufferHEVC' has no member named 'pred_weight_table_bit_length' 61 | slice.pred_weight_table_bit_length = itSSH->; | ^~~~~~~~~~~~~~~~~~~~~~~~~~~~ make[2]: *** [_studio/mfx_lib/encode_hw/CMakeFiles/encode_hw.dir/build.make:902: _studio/mfx_lib/encode_hw/CMakeFiles/encode_hw.dir/hevc/linux/base/hevcehw_base_weighted_prediction_lin.cpp.o] Error 1 make[2]: Leaving directory '/ramdisk/yay/intel-media-sdk-git/src/build' make[1]: *** [CMakeFiles/Makefile2:2954: _studio/mfx_lib/encode_hw/CMakeFiles/encode_hw.dir/all] Error 2 make[1]: Leaving directory '/ramdisk/yay/intel-media-sdk-git/src/build' make: *** [Makefile:146: all] Error 2 make: Leaving directory '/ramdisk/yay/intel-media-sdk-git/src/build' ==> ERROR: A failure occurred in build(). Aborting...

dbermond commented on 2021-08-04 15:50 (UTC)

@NobodyDBG Package is building fine for me. Your log shows that you are using an AUR helper, and AUR helpers are not supported. Please use makepkg. And please post logs in english when commenting.

NobodyDBG commented on 2021-08-03 20:20 (UTC) (edited on 2021-08-03 20:21 (UTC) by NobodyDBG)

Can't update. Get follwed build-error:

[ 95%] Built target mfx_dispatch_test make[2]: Verzeichnis „/ramdisk/yay/intel-media-sdk-git/src/build“ wird verlassen [ 95%] Built target mfx_h264la_hw64 /ramdisk/yay/intel-media-sdk-git/src/MediaSDK/_studio/mfx_lib/encode_hw/hevc/linux/base/hevcehw_base_weighted_prediction_lin.cpp: In Lambda-Funktion: /ramdisk/yay/intel-media-sdk-git/src/MediaSDK/_studio/mfx_lib/encode_hw/hevc/linux/base/hevcehw_base_weighted_prediction_lin.cpp:60:19: Fehler: »VAEncSliceParameterBufferHEVC« hat kein Element namens »pred_weight_table_bit_offset« 60 | slice.pred_weight_table_bit_offset = itSSH->; | ^~~~~~~~~~~~~~~~~~~~~~~~~~~~ /ramdisk/yay/intel-media-sdk-git/src/MediaSDK/_studio/mfx_lib/encode_hw/hevc/linux/base/hevcehw_base_weighted_prediction_lin.cpp:61:19: Fehler: »VAEncSliceParameterBufferHEVC« hat kein Element namens »pred_weight_table_bit_length« 61 | slice.pred_weight_table_bit_length = itSSH->; | ^~~~~~~~~~~~~~~~~~~~~~~~~~~~ make[2]: [_studio/mfx_lib/encode_hw/CMakeFiles/encode_hw.dir/build.make:902: _studio/mfx_lib/encode_hw/CMakeFiles/encode_hw.dir/hevc/linux/base/hevcehw_base_weighted_prediction_lin.cpp.o] Fehler 1 make[2]: Verzeichnis „/ramdisk/yay/intel-media-sdk-git/src/build“ wird verlassen make[1]: [CMakeFiles/Makefile2:2954: _studio/mfx_lib/encode_hw/CMakeFiles/encode_hw.dir/all] Fehler 2 make[1]: Verzeichnis „/ramdisk/yay/intel-media-sdk-git/src/build“ wird verlassen make: *** [Makefile:146: all] Fehler 2 make: Verzeichnis „/ramdisk/yay/intel-media-sdk-git/src/build“ wird verlassen ==> FEHLER: Ein Fehler geschah in build(). Breche ab... error making: intel-media-sdk-git (libmfx-git)

dbermond commented on 2018-10-05 16:10 (UTC)

@dark-saber Thank you for reporting this upstream change. Fixed.

dark-saber commented on 2018-10-05 08:54 (UTC) (edited on 2018-10-05 13:00 (UTC) by dark-saber)

COPYING file was removed from upstream, only LICENSE left.

dbermond commented on 2018-08-11 10:32 (UTC)

@MichaelChou Thank you for reporting this. Fixed.

MichaelChou commented on 2018-08-11 08:13 (UTC)

@dbermond You forgot to update checksum of intel-media-sdk-git.conf

dbermond commented on 2018-02-10 00:01 (UTC)

@MichaelChou Good to know that you got it working :)

MichaelChou commented on 2018-02-09 04:27 (UTC)

@dbermond Thank you. This did solve the problem.

dbermond commented on 2018-02-08 14:22 (UTC)

@MichaelChou This is normal and expected. To be able to build, firstly you need to uninstall intel-media-sdk-git from your system. Rebuild the package after uninstallation, and install it again. Something like this:

# pacman -Rnsdd intel-media-sdk-git
$ makepkg -risC

Or build in a clean chroot.

MichaelChou commented on 2018-02-08 05:52 (UTC)

@dbermond Thank you for your hard work.

It's strange that I failed to build right after this commit:

All the changes are wrapped in "#if (MFX_VERSION >= MFX_VERSION_NEXT)", I couldn't figure out why it failed.

Error message:

dbermond commented on 2018-01-16 16:07 (UTC)

@MichaelChou Package is now building fine against the latest upstream changes. Thank you for the interest.

MichaelChou commented on 2018-01-15 03:45 (UTC)

There is no /usr/lib/lin_${_arch} any more