Package Details: darling r3131.fa5348c8a-1

Git Clone URL: https://aur.archlinux.org/darling.git (read-only, click to copy)
Package Base: darling
Description: Darwin/macOS emulation layer for Linux (Stable)
Upstream URL: http://www.darlinghq.org
Keywords: Darwin Emulator macOS OSX Stable Wine
Licenses: GPL3
Groups: darling
Conflicts: darling
Provides: darling
Submitter: jamesbrink
Maintainer: jamesbrink
Last Packager: jamesbrink
Votes: 7
Popularity: 1.01
First Submitted: 2019-07-10 02:21
Last Updated: 2020-07-27 17:54

Required by (1)

Sources (113)

Pinned Comments

jamesbrink commented on 2019-07-10 02:37

This package is identical to the darling-git, but it will remain locked in on git refs that are known to build. I have labeled it stable in an attempt to clarify this.

Latest Comments

1 2 3 Next › Last »

crazyquark commented on 2021-05-06 07:52

The LFS issue has been resolved after I reported it to them on Github, however there is another build issue now.

    #define __CF_NAMED_ENUM(_type, _name)     enum _name : _type _name; enum _name : _type
                                                        ^~~~~~~
    In file included from /home/cristian/Desktop/Workspace/darling/src/darling/src/CoreAudio/CoreAudioUtilityClasses/CoreAudio/PublicUtility/CABufferList.cpp:47:
    In file included from /home/cristian/Desktop/Workspace/darling/src/darling/src/CoreAudio/AudioFileTools/../CoreAudioUtilityClasses/CoreAudio/PublicUtility/CABufferList.h:51:
    In file included from /home/cristian/Desktop/Workspace/darling/src/darling/src/CoreAudio/AudioFileTools/../CoreAudioUtilityClasses/CoreAudio/PublicUtility/CAStreamBasicDescription.h:52:
    In file included from /home/cristian/Desktop/Workspace/darling/src/darling/src/external/corefoundation/include/CoreFoundation/CoreFoundation.h:78:
    In file included from /home/cristian/Desktop/Workspace/darling/src/darling/src/external/corefoundation/include/CoreFoundation/CFPropertyList.h:36:
    In file included from /home/cristian/Desktop/Workspace/darling/src/darling/src/external/corefoundation/include/CoreFoundation/CFStream.h:34:
    /home/cristian/Desktop/Workspace/darling/src/darling/src/external/corefoundation/include/CoreFoundation/CFURL.h:39:9: error: non-defining declaration of enumeration with a fixed underlying type is only permitted as a standalone declaration; missing list of enumerators? [-Welaborated-enum-base]
    typedef CF_ENUM(CFIndex, CFURLPathStyle) {
            ^~~~~~~~~~~~~~~~~~~~~~~~~~~~~~~~

crazyquark commented on 2021-05-05 08:58

@Kido, looks like the https://github.com/darlinghq/darling-swift.git repo has reached a download quota; it might be that they need to insert money into Microsoft's slot machine... I know, this is not helpful but that's the issue, If you try to clone https://github.com/darlinghq/darling-swift.git (the problem repo) you get: This repository is over its data quota. Account responsible for LFS bandwidth should purchase more data packs to restore access.

Kido commented on 2021-05-02 17:02

I'm getting git-lfs error on fetching darling-swift mentioned in the comments.

How can I fix it?

konicks commented on 2021-03-26 16:51

@jamesbrink well it still doesn't build, regardless of clarification or branches it shouldn't be marked as stable if it doesn't build, please fix your app/PKGBUILD as it's a really great project and not being able to install it is a shame

thebagarius commented on 2021-01-18 14:14

Hi,

To add to what @Alkaris said, I get the following error message while building:

/usr/include/gnu/stubs.h:7:11: fatal error: 'gnu/stubs-32.h' file not found

which results in the same build failure.

dreieck commented on 2021-01-12 19:57

I get the same error which @Alkis reported on 2020-12-08. (Same error as I get for darling-git.)

Thanks for maintaining and making it building again!

Alkaris commented on 2020-12-08 04:32

This does not build at all, and shouldn't be labeled stable

4 warnings generated.
[  0%] Linking CXX executable x86_64-apple-darwin11-ld
[  0%] Built target x86_64-apple-darwin11-ld
make: *** [Makefile:149: all] Error 2
==> ERROR: A failure occurred in build().
    Aborting...

CyberShadow commented on 2020-11-27 08:55

CMake Error at src/external/cocotron/AppKit/CMakeLists.txt:19 (message):
  XRandR not found

Missing dependency?

ljrk commented on 2020-11-24 14:54

Due to this using Git LFS, fetching binaries for darling-swift fails as these aren't cloned initially by makepkg when cloning the sources. After setting the URL to the local paths, git submodule update fails to get these files from the remote.

melvyn2 commented on 2020-11-05 04:20

I run into the same issue as simona, anything I should do?